{"text_format":"1","workbook":"xlsx","n_sheets":5,"sheets":["Availability Chart","JH","CE","EL","Prices"],"not_rendered":{"charts":0,"images":8,"macros":1,"external_links":0,"defined_names":15,"comments":0,"pivot_tables":0},"unopened":[],"bounds":{"document_bytes":16777216,"sheet_cells":100000,"rows_first":2000,"rows_last":500,"rows_between":2000,"halvings":0,"cell_chars":16384,"cell_head_chars":4096},"cells_cut":0,"cells_raw":0,"read":"whole","date_system":"1900"}

{"sheet":"Availability Chart","index":0,"n_rows":125,"n_cols":39,"rows_kept":125,"cut":false,"hidden":false,"merged":[[6,21,7,21],[6,22,7,22],[3,1,4,12],[6,8,7,10],[6,11,7,11],[6,12,7,12],[6,18,7,20],[3,18,4,22]]}
[null,null,null,null,null,null,null,null,{"$f":"+I7","v":"Melamine"},{"$f":"+I1","v":"Melamine"},{"$f":"+J1","v":"Melamine"},{"$f":"+L7","v":"J-Handle"},"Eurolight"]
[null,null,null,null,null,null,null,null,"CE","CE","CE","JH","EL"]
[]
[null,"Cut to measure availability Chart",null,null,null,null,null,null,null,null,null,null,null,null,null,null,null,null,"Price List\n*click on any combination to view prices"]
[]
[]
[null,"Click the appropriate rectangle to go to the correct order form / Price",null,null,null,null,null,null,"Melamine",null,null,"J-Handle","Eurolight",null,null,null,null,null,"Melamine",null,null,"J-Handle","Eurolight",null,null,null,0,{"$f":"SUBSTITUTE(VLOOKUP(AA7,$AA$11:$AF$50,3,FALSE),\"Prices!\",\"\")","v":{"$error":"#N/A"}}]
[]
[null,"Category","Brand","Substrate","Colour","Finish","Colour Group","Colours","16mm","18mm","25mm","22mm","50mm",null,null,null,null,null,"16mm","18mm","25mm","22mm","50mm",null,null,null,null,"Name","Range Matrix","Range Y","Range X","Line","Height","Width","Min H","Min W",null,"#","Price List Name"]
[]
[null,"MELAMINE","E","NON MR","H1145","ST22","Woodgrain","Natural Bardolino Oak","SE","","SE",null,null,null,null,null,null,null,5,0,6,0,0,null,null,null,1,{"$f":"INDIRECT(\"Prices!B\"&MATCH(AA11,Prices!$B$1:$B$10014,0)-1)","v":"J Handle Grey Beige Gladstone Oak"},{"$f":"\"Prices!C\"&AF11+1&\":U\"&AF12-3","v":"Prices!C6:U14"},{"$f":"\"Prices!D\"&AF11+1&\":U\"&AF11+1","v":"Prices!D6:U6"},{"$f":"\"Prices!C\"&AF11+2&\":C\"&AF12-3","v":"Prices!C7:C14"},{"$f":"MATCH(AB11,Prices!B:B,0)+1","v":5},{"$f":"MAX(IFERROR(INT(RIGHT(INDIRECT(\"Prices!C\"&AF11+1&\":C\"&AF12-2),\nLEN(INDIRECT(\"Prices!C\"&AF11+1&\":C\"&AF12-2))-\nFIND(\"-\",INDIRECT(\"Prices!C\"&AF11+1&\":C\"&AF12-2),1))),0))","v":1490},{"$f":"MAX(IFERROR(INT(RIGHT(INDIRECT(\"Prices!D\"&AF11+1&\":u\"&AF11+1),\nLEN(INDIRECT(\"Prices!D\"&AF11+1&\":U\"&AF11+1))-\nFIND(\"-\",INDIRECT(\"Prices!D\"&AF11+1&\":U\"&AF11+1),1))),0))","v":2790},{"$f":"MIN(IFERROR(INT(LEFT(INDIRECT(\"Prices!C\"&AF11+1&\":C\"&AF12-2),\nFIND(\"-\",INDIRECT(\"Prices!C\"&AF11+1&\":C\"&AF12-2),1)-1)),99999))","v":148},{"$f":"MIN(IFERROR(INT(LEFT(INDIRECT(\"Prices!D\"&AF11+1&\":O\"&AF11+1),\nFIND(\"-\",INDIRECT(\"Prices!D\"&AF11+1&\":O\"&AF11+1),1)-1)),99999))","v":148},null,{"$f":"AA11","v":1},{"$f":"AB11","v":"J Handle Grey Beige Gladstone Oak"}]
[null,"MELAMINE","E","NON MR","H1146","ST10","Woodgrain","Grey Bardolino Oak","SE",null,"SE",null,null,null,null,null,null,null,5,null,6,null,null,null,null,null,2,{"$f":"INDIRECT(\"Prices!B\"&MATCH(AA12,Prices!$B$1:$B$10042,0)-1)","v":"J Handle Premium White Gloss"},{"$f":"\"Prices!C\"&AF12+1&\":O\"&AF13-3","v":"Prices!C18:O31"},{"$f":"\"Prices!D\"&AF12+1&\":T\"&AF12+1","v":"Prices!D18:T18"},{"$f":"\"Prices!C\"&AF12+2&\":C\"&AF13-3","v":"Prices!C19:C31"},{"$f":"MATCH(AB12,Prices!B:B,0)+1","v":17},{"$f":"MAX(IFERROR(INT(RIGHT(INDIRECT(\"Prices!C\"&AF12+1&\":C\"&AF13-2),\nLEN(INDIRECT(\"Prices!C\"&AF12+1&\":C\"&AF13-2))-\nFIND(\"-\",INDIRECT(\"Prices!C\"&AF12+1&\":C\"&AF13-2),1))),0))","v":2790},{"$f":"MAX(IFERROR(INT(RIGHT(INDIRECT(\"Prices!D\"&AF12+1&\":O\"&AF12+1),\nLEN(INDIRECT(\"Prices!D\"&AF12+1&\":O\"&AF12+1))-\nFIND(\"-\",INDIRECT(\"Prices!D\"&AF12+1&\":O\"&AF12+1),1))),0))","v":1490},{"$f":"MIN(IFERROR(INT(LEFT(INDIRECT(\"Prices!C\"&AF12+1&\":C\"&AF13-2),\nFIND(\"-\",INDIRECT(\"Prices!C\"&AF12+1&\":C\"&AF13-2),1)-1)),99999))","v":148},{"$f":"MIN(IFERROR(INT(LEFT(INDIRECT(\"Prices!D\"&AF12+1&\":O\"&AF12+1),\nFIND(\"-\",INDIRECT(\"Prices!D\"&AF12+1&\":O\"&AF12+1),1)-1)),99999))","v":148},null,{"$f":"AA12","v":2},"J Handle Premium White Gloss"]
[null,"MELAMINE","E","NON MR","H1267","ST22","Woodgrain","Molina Sand","SE",null,"SE",null,null,null,null,null,null,null,5,null,6,null,null,null,null,null,3,{"$f":"INDIRECT(\"Prices!B\"&MATCH(AA13,Prices!$B$1:$B$10042,0)-1)","v":"J Handle Premium White"},{"$f":"\"Prices!C\"&AF13+1&\":T\"&AF14-3","v":"Prices!C35:T48"},"Prices!D35:T35","Prices!C36:C48",{"$f":"MATCH(AB13,Prices!B:B,0)+1","v":34},{"$f":"MAX(IFERROR(INT(RIGHT(INDIRECT(\"Prices!C\"&AF13+1&\":C\"&AF14-2),\nLEN(INDIRECT(\"Prices!C\"&AF13+1&\":C\"&AF14-2))-\nFIND(\"-\",INDIRECT(\"Prices!C\"&AF13+1&\":C\"&AF14-2),1))),0))","v":2790},{"$f":"MAX(IFERROR(INT(RIGHT(INDIRECT(\"Prices!D\"&AF13+1&\":O\"&AF13+1),\nLEN(INDIRECT(\"Prices!D\"&AF13+1&\":O\"&AF13+1))-\nFIND(\"-\",INDIRECT(\"Prices!D\"&AF13+1&\":O\"&AF13+1),1))),0))","v":1490},{"$f":"MIN(IFERROR(INT(LEFT(INDIRECT(\"Prices!C\"&AF13+1&\":C\"&AF14-2),\nFIND(\"-\",INDIRECT(\"Prices!C\"&AF13+1&\":C\"&AF14-2),1)-1)),99999))","v":148},{"$f":"MIN(IFERROR(INT(LEFT(INDIRECT(\"Prices!D\"&AF13+1&\":O\"&AF13+1),\nFIND(\"-\",INDIRECT(\"Prices!D\"&AF13+1&\":O\"&AF13+1),1)-1)),99999))","v":148},null,3,"J Handle Premium White"]
[null,"MELAMINE","E","NON MR","H1387","ST10","Woodgrain","Graphite Denver Oak","SE",null,"SE",null,null,null,null,null,null,null,5,null,6,null,null,null,null,null,4,{"$f":"INDIRECT(\"Prices!B\"&MATCH(AA14,Prices!$B$1:$B$10042,0)-1)","v":"J Handle Perfect Sense"},"Prices!C52:T65","Prices!D52:T52","Prices!C53:C65",{"$f":"MATCH(AB14,Prices!B:B,0)+1","v":51},{"$f":"MAX(IFERROR(INT(RIGHT(INDIRECT(\"Prices!C\"&AF14+1&\":C\"&AF15-2),\nLEN(INDIRECT(\"Prices!C\"&AF14+1&\":C\"&AF15-2))-\nFIND(\"-\",INDIRECT(\"Prices!C\"&AF14+1&\":C\"&AF15-2),1))),0))","v":2790},{"$f":"MAX(IFERROR(INT(RIGHT(INDIRECT(\"Prices!D\"&AF14+1&\":Q\"&AF14+1),\nLEN(INDIRECT(\"Prices!D\"&AF14+1&\":Q\"&AF14+1))-\nFIND(\"-\",INDIRECT(\"Prices!D\"&AF14+1&\":Q\"&AF14+1),1))),0))","v":1490},{"$f":"MIN(IFERROR(INT(LEFT(INDIRECT(\"Prices!C\"&AF14+1&\":C\"&AF15-2),\nFIND(\"-\",INDIRECT(\"Prices!C\"&AF14+1&\":C\"&AF15-2),1)-1)),99999))","v":148},{"$f":"MIN(IFERROR(INT(LEFT(INDIRECT(\"Prices!D\"&AF14+1&\":O\"&AF14+1),\nFIND(\"-\",INDIRECT(\"Prices!D\"&AF14+1&\":O\"&AF14+1),1)-1)),99999))","v":148},null,4,"J Handle Perfect Sense"]
[null,"MELAMINE","E","NON MR","H3077","ST22","Woodgrain","Ceramic Grey","SE",null,"SE",null,null,null,null,null,null,null,5,null,6,null,null,null,null,null,5,{"$f":"INDIRECT(\"Prices!B\"&MATCH(AA15,Prices!$B$1:$B$10042,0)-1)","v":"Wardrobe Range 16mm"},{"$f":"\"Prices!C\"&AF15+1&\":Q\"&AF16-3","v":"Prices!C69:Q80"},{"$f":"\"Prices!D\"&AF15+1&\":Q\"&AF15+1","v":"Prices!D69:Q69"},"Prices!C70:C80",{"$f":"MATCH(AB15,Prices!B:B,0)+1","v":68},{"$f":"MAX(IFERROR(INT(RIGHT(INDIRECT(\"Prices!C\"&AF15+1&\":C\"&AF16-2),\nLEN(INDIRECT(\"Prices!C\"&AF15+1&\":C\"&AF16-2))-\nFIND(\"-\",INDIRECT(\"Prices!C\"&AF15+1&\":C\"&AF16-2),1))),0))","v":2780},{"$f":"MAX(IFERROR(INT(RIGHT(INDIRECT(\"Prices!D\"&AF15+1&\":Q\"&AF15+1),\nLEN(INDIRECT(\"Prices!D\"&AF15+1&\":Q\"&AF15+1))-\nFIND(\"-\",INDIRECT(\"Prices!D\"&AF15+1&\":Q\"&AF15+1),1))),0))","v":2000},{"$f":"MIN(IFERROR(INT(LEFT(INDIRECT(\"Prices!C\"&AF15+1&\":C\"&AF16-2),\nFIND(\"-\",INDIRECT(\"Prices!C\"&AF15+1&\":C\"&AF16-2),1)-1)),99999))","v":80},{"$f":"MIN(IFERROR(INT(LEFT(INDIRECT(\"Prices!D\"&AF15+1&\":O\"&AF15+1),\nFIND(\"-\",INDIRECT(\"Prices!D\"&AF15+1&\":O\"&AF15+1),1)-1)),99999))","v":80},null,5,"Wardrobe Range 16mm"]
{"$rows_left_out":111}
{"sheet":"JH","index":1,"n_rows":47,"n_cols":31,"rows_kept":47,"cut":false,"hidden":false,"merged":[[9,5,9,10],[10,5,10,10],[11,5,11,10],[44,3,44,12],[45,3,45,12],[17,8,17,11],[17,12,18,12],[6,5,6,10],[7,5,7,10],[8,5,8,10],[1,3,1,6],[3,4,3,6],[4,5,4,10],[5,5,5,10],[2,3,2,10],[44,13,45,13],[17,13,18,13],[14,3,14,9],[15,3,15,9],[17,3,18,3],[17,4,18,4],[17,5,18,5],[17,6,18,6],[17,7,18,7]]}
[null,null,null,null,null,null,null,null,null,null,null,null,null,null,null,null,3]
[]
[null,null,null,"J-HANDLE Order Form",null,null,null,null,null,null,null,null,null,null,null,null,{"$f":"VLOOKUP($Q1,'Availability Chart'!$AA$11:$AF$100,COLUMN(B1),FALSE)","v":"J Handle Premium White"},{"$f":"VLOOKUP($Q1,'Availability Chart'!$AA$11:$AF$100,COLUMN(C1),FALSE)","v":"Prices!C35:T48"},{"$f":"VLOOKUP($Q1,'Availability Chart'!$AA$11:$AF$100,COLUMN(D1),FALSE)","v":"Prices!D35:T35"},{"$f":"VLOOKUP($Q1,'Availability Chart'!$AA$11:$AF$100,COLUMN(E1),FALSE)","v":"Prices!C36:C48"},{"$f":"VLOOKUP($Q1,'Availability Chart'!$AA$11:$AF$100,COLUMN(F1),FALSE)","v":34},null,null,null,"All","NoJ",null,"Grain","Plain"]
[]
[null,null,null,"Company Name",null,null,null,null,null,null,null,null,null,null,null,null,null,null,null,null,null,null,null,null,"Y","Y",null,"Horizontal","Plain"]
[null,null,null,"Contact Person",null,null,null,null,null,null,null,null,null,null,null,null,null,null,null,null,null,null,null,null,"N","N",null,"Vertical"]
[null,null,null,"Address",null,null,null,null,null,null,null,null,null,null,null,null,"Colour Group",null,null,null,null,null,null,null,"J"]
[null,null,null,"Customer Order #",null,null,null,null,null,null,null,null,null,null,null,null,"Plain",null,{"$f":"IF(Q8=\"Plain\",\"Plain\",\"Grain\")","v":"Plain"}]
[null,null,null,"Phone #:"]
[null,null,null,"Email:"]
[null,null,null,"Other:"]
[null,null,null,"Date",null,{"$f":"TODAY()","v":"2020-09-01"}]
[null,null,null,"(automatically set to today when sending)"]
[]
[null,null,null,"Colour"]
{"$rows_left_out":33}
{"sheet":"CE","index":2,"n_rows":47,"n_cols":31,"rows_kept":47,"cut":false,"hidden":false,"merged":[[1,3,1,5],[4,3,4,4],[5,3,5,4],[2,3,2,11],[6,3,6,4],[44,13,45,13],[44,3,44,12],[45,3,45,12],[17,8,17,11],[17,12,18,12],[17,13,18,13],[17,6,18,6],[17,5,18,5],[17,4,18,4],[17,3,18,3],[17,7,18,7],[7,3,7,4],[8,3,8,4],[4,5,4,10],[5,5,5,10],[6,5,6,10],[7,5,7,10],[8,5,8,10],[15,8,15,11],[9,3,9,4],[10,3,10,4],[11,3,11,4],[12,3,12,11],[14,3,14,7],[15,3,15,7],[14,8,14,11],[11,5,11,10],[9,5,9,10],[10,5,10,10]]}
[null,null,null,null,null,null,null,null,null,null,null,null,null,null,null,null,16]
[]
[null,null,null,"Cut & Edge Order Form",null,null,null,null,null,null,null,null,null,null,null,null,{"$f":"VLOOKUP($Q1,'Availability Chart'!$AA$11:$AF$100,COLUMN(B1),FALSE)","v":"PerfectSense Matt & Gloss 18mm"},{"$f":"VLOOKUP($Q1,'Availability Chart'!$AA$11:$AF$100,COLUMN(C1),FALSE)","v":"Prices!C233:N244"},{"$f":"VLOOKUP($Q1,'Availability Chart'!$AA$11:$AF$100,COLUMN(D1),FALSE)","v":"Prices!D233:N233"},{"$f":"VLOOKUP($Q1,'Availability Chart'!$AA$11:$AF$100,COLUMN(E1),FALSE)","v":"Prices!C234:C244"},{"$f":"VLOOKUP($Q1,'Availability Chart'!$AA$11:$AF$100,COLUMN(F1),FALSE)","v":232}]
[]
[null,null,null,"Company Name"]
[null,null,null,"Contact Person"]
[null,null,null,"Address"]
[null,null,null,"Customer Order #"]
[null,null,null,"Phone #:"]
[null,null,null,"Email:"]
[null,null,null,"Other:"]
[null,null,null,"Date",null,{"$f":"TODAY()","v":"2020-09-01"}]
[null,null,null,"(automatically set to today when sending)"]
[]
[null,null,null,"Colour",null,null,null,null,"Thickness"]
{"$rows_left_out":33}
{"sheet":"EL","index":3,"n_rows":47,"n_cols":31,"rows_kept":47,"cut":false,"hidden":false,"merged":[[44,13,45,13],[44,3,44,8],[45,3,45,8],[1,3,1,8],[2,3,2,8],[4,5,4,7],[14,3,14,8],[15,3,15,8],[11,5,11,7],[5,5,5,7],[6,5,6,7],[7,5,7,7],[8,5,8,7],[9,5,9,7],[10,5,10,7],[17,3,18,3],[17,4,18,4],[17,5,18,5],[17,7,18,7],[17,8,18,8],[17,13,18,13],[9,3,9,4],[10,3,10,4],[11,3,11,4],[12,3,12,7],[4,3,4,4],[5,3,5,4],[6,3,6,4],[7,3,7,4],[8,3,8,4]]}
[null,null,12,null,null,null,null,null,null,null,null,null,null,null,null,null,20]
[]
[null,null,null,"Eurolight Order Form"]
[]
[null,null,null,"Company Name"]
[null,null,null,"Contact Person"]
[null,null,null,"Address"]
[null,null,null,"Customer Order #",null,null,null,null,null,null,null,null,null,null,null,null,"Plain"]
[null,null,null,"Phone #:"]
[null,null,null,"Email:"]
[null,null,null,"Other:"]
[null,null,null,"Date",null,{"$f":"TODAY()","v":"2020-09-01"}]
[null,null,null,"(automatically set to today when sending)"]
[]
[null,null,null,"Colour"]
{"$rows_left_out":33}
{"sheet":"Prices","index":4,"n_rows":308,"n_cols":21,"rows_kept":308,"cut":false,"hidden":false,"merged":[[4,2,4,20],[5,1,12,1],[16,2,16,14],[17,1,29,1],[33,2,33,14],[34,1,47,1],[50,2,50,14],[51,1,64,1],[67,2,67,16],[68,1,79,1],[82,2,82,16],[83,1,94,1],[111,2,111,16],[112,1,123,1],[126,2,126,16],[98,1,108,1],[97,2,97,13],[127,1,138,1],[141,2,141,16],[142,1,153,1],[156,2,156,16],[157,1,168,1],[262,1,273,1],[277,1,288,1],[292,1,303,1],[307,1,307,3],[171,2,171,16],[172,1,183,1],[186,2,186,16],[187,1,198,1],[201,2,201,16],[202,1,213,1],[216,2,216,16],[217,1,228,1],[231,2,231,16],[232,1,243,1],[247,1,258,1]]}
[]
[null,"Price Lists"]
[]
[null,"J Handle Grey Beige Gladstone Oak"]
[null,1,"WIDTH (mm)"]
[null,"HEIGHT (mm)",null,"148-300","301-350","351-400","401-450","451-500","501-550","551-600","601-650","651-800","801-1000","1001-1200","1201-1490","1491-1700","1701-1900","1901-2100","2101-2400","2401-2600","2601-2790"]
[null,null,"148-200",26.945559081818971,28.324281584210063,29.703004086601169,31.045444417876698,32.412072863229277,33.778701308581859,35.157423810972951,36.511958199287015,40.648125706460306,46.10254543083208,51.556965155203898,64.016565067711497,73.039033969872193,81.631861495739486,90.224689021606821,123.73671637248935,134.04810940353011,143.84393278301886]
[null,null,"201-400",34.504344730892967,36.923156138596639,39.354061603338842,41.772873011042513,44.179590361707668,46.610495826449856,49.029307234153549,51.47230675593427,58.716646922006774,68.391892552821474,78.055044126597679,96.918346457192101,110.57797917934673,123.58715320044632,136.59632722154595,187.33210590383442,202.94311472915393,217.77357311320753]
[null,null,"401-600",42.099412551082523,45.558312864098781,49.029307234153556,52.536583775323884,55.995484088340163,59.4543844013564,62.925378771411182,66.384279084427433,76.821450308668815,90.705427788887931,104.58940526910703,129.86517820914125,148.16832413123498,165.59989167608617,183.03145922093731,251.01457264585687,271.93245369967832,291.8044407008087]
[null,null,"601-750",47.771525302147644,52.052821493783135,56.285741457264592,60.56703764890009,64.812051669420057,69.057065689940003,73.350455938614033,77.607564016172503,90.378888248847915,107.43150867315887,124.45994098339271,154.53776005437928,176.31824972647303,197.06157322370515,217.80489672093725,298.70385836014248,323.59584655682107,347.24323534366562]
[null,null,"751-900",53.467826167289786,58.523142009390483,63.542175680375621,68.585397465437779,73.652807364576972,78.696029149639145,83.751344991739828,88.806660833840553,103.93632618902701,124.15758955742979,144.34257075471697,179.22535868710693,204.48530856918239,228.54240369496853,252.59949882075472,346.42216981132071,375.29068396226415,402.7157724056604]
[null,null,"901-1200",64.812051669420043,71.463783040605179,78.055044126597693,84.694681440744276,91.310130640813853,97.949767954960436,104.58940526910703,111.20485446917657,131.11167235457788,157.59765726893315,184.11992435440396,228.61557274005162,260.8365595020723,291.52321356113964,322.20986762020692,441.88781845056951,478.7118033214503,513.6945889487871]
[null,null,"1201-1490",75.672595517056493,83.829714481349455,91.98683344564239,100.14395240993537,108.30107137422834,116.42215004854648,124.59128244283106,132.73638797713241,157.19573144001973,189.81219386719997,218.18791550734716,270.91666175495612,309.09954696874183,345.46419955329964,381.82885213785761,523.65099721763318,567.28858031910261,608.74428426549855]
[]
[]
{"$rows_left_out":293}