{"text_format":"1","workbook":"xlsx","n_sheets":5,"sheets":["Availability Chart","JH","CE","EL","Prices"],"not_rendered":{"charts":0,"images":8,"macros":1,"external_links":0,"defined_names":15,"comments":0,"pivot_tables":0},"unopened":[],"bounds":{"document_bytes":16777216,"sheet_cells":100000,"rows_first":2000,"rows_last":500,"rows_between":2000,"halvings":0,"cell_chars":16384,"cell_head_chars":4096},"cells_cut":0,"cells_raw":0,"read":"whole","date_system":"1900"}

{"sheet":"Availability Chart","index":0,"n_rows":125,"n_cols":39,"rows_kept":125,"cut":false,"hidden":false,"merged":[[6,21,7,21],[6,22,7,22],[3,1,4,12],[6,8,7,10],[6,11,7,11],[6,12,7,12],[6,18,7,20],[3,18,4,22]]}
[null,null,null,null,null,null,null,null,{"$f":"+I7","v":"Melamine"},{"$f":"+I1","v":"Melamine"},{"$f":"+J1","v":"Melamine"},{"$f":"+L7","v":"J-Handle"},"Eurolight"]
[null,null,null,null,null,null,null,null,"CE","CE","CE","JH","EL"]
[]
[null,"Cut to measure availability Chart",null,null,null,null,null,null,null,null,null,null,null,null,null,null,null,null,"Price List\n*click on any combination to view prices"]
[]
[]
[null,"Click the appropriate rectangle to go to the correct order form / Price",null,null,null,null,null,null,"Melamine",null,null,"J-Handle","Eurolight",null,null,null,null,null,"Melamine",null,null,"J-Handle","Eurolight",null,null,null,0,{"$f":"SUBSTITUTE(VLOOKUP(AA7,$AA$11:$AF$50,3,FALSE),\"Prices!\",\"\")","v":{"$error":"#N/A"}}]
[]
[null,"Category","Brand","Substrate","Colour","Finish","Colour Group","Colours","16mm","18mm","25mm","22mm","50mm",null,null,null,null,null,"16mm","18mm","25mm","22mm","50mm",null,null,null,null,"Name","Range Matrix","Range Y","Range X","Line","Height","Width","Min H","Min W",null,"#","Price List Name"]
[]
[null,"MELAMINE","E","NON MR","H1145","ST22","Woodgrain","Natural Bardolino Oak","SE","","SE",null,null,null,null,null,null,null,5,0,6,0,0,null,null,null,1,{"$f":"INDIRECT(\"Prices!B\"&MATCH(AA11,Prices!$B$1:$B$10014,0)-1)","v":"J Handle Grey Beige Gladstone Oak"},{"$f":"\"Prices!C\"&AF11+1&\":U\"&AF12-3","v":"Prices!C6:U14"},{"$f":"\"Prices!D\"&AF11+1&\":U\"&AF11+1","v":"Prices!D6:U6"},{"$f":"\"Prices!C\"&AF11+2&\":C\"&AF12-3","v":"Prices!C7:C14"},{"$f":"MATCH(AB11,Prices!B:B,0)+1","v":5},{"$f":"MAX(IFERROR(INT(RIGHT(INDIRECT(\"Prices!C\"&AF11+1&\":C\"&AF12-2),\nLEN(INDIRECT(\"Prices!C\"&AF11+1&\":C\"&AF12-2))-\nFIND(\"-\",INDIRECT(\"Prices!C\"&AF11+1&\":C\"&AF12-2),1))),0))","v":1490},{"$f":"MAX(IFERROR(INT(RIGHT(INDIRECT(\"Prices!D\"&AF11+1&\":u\"&AF11+1),\nLEN(INDIRECT(\"Prices!D\"&AF11+1&\":U\"&AF11+1))-\nFIND(\"-\",INDIRECT(\"Prices!D\"&AF11+1&\":U\"&AF11+1),1))),0))","v":2790},{"$f":"MIN(IFERROR(INT(LEFT(INDIRECT(\"Prices!C\"&AF11+1&\":C\"&AF12-2),\nFIND(\"-\",INDIRECT(\"Prices!C\"&AF11+1&\":C\"&AF12-2),1)-1)),99999))","v":148},{"$f":"MIN(IFERROR(INT(LEFT(INDIRECT(\"Prices!D\"&AF11+1&\":O\"&AF11+1),\nFIND(\"-\",INDIRECT(\"Prices!D\"&AF11+1&\":O\"&AF11+1),1)-1)),99999))","v":148},null,{"$f":"AA11","v":1},{"$f":"AB11","v":"J Handle Grey Beige Gladstone Oak"}]
[null,"MELAMINE","E","NON MR","H1146","ST10","Woodgrain","Grey Bardolino Oak","SE",null,"SE",null,null,null,null,null,null,null,5,null,6,null,null,null,null,null,2,{"$f":"INDIRECT(\"Prices!B\"&MATCH(AA12,Prices!$B$1:$B$10042,0)-1)","v":"J Handle Premium White Gloss"},{"$f":"\"Prices!C\"&AF12+1&\":O\"&AF13-3","v":"Prices!C18:O31"},{"$f":"\"Prices!D\"&AF12+1&\":T\"&AF12+1","v":"Prices!D18:T18"},{"$f":"\"Prices!C\"&AF12+2&\":C\"&AF13-3","v":"Prices!C19:C31"},{"$f":"MATCH(AB12,Prices!B:B,0)+1","v":17},{"$f":"MAX(IFERROR(INT(RIGHT(INDIRECT(\"Prices!C\"&AF12+1&\":C\"&AF13-2),\nLEN(INDIRECT(\"Prices!C\"&AF12+1&\":C\"&AF13-2))-\nFIND(\"-\",INDIRECT(\"Prices!C\"&AF12+1&\":C\"&AF13-2),1))),0))","v":2790},{"$f":"MAX(IFERROR(INT(RIGHT(INDIRECT(\"Prices!D\"&AF12+1&\":O\"&AF12+1),\nLEN(INDIRECT(\"Prices!D\"&AF12+1&\":O\"&AF12+1))-\nFIND(\"-\",INDIRECT(\"Prices!D\"&AF12+1&\":O\"&AF12+1),1))),0))","v":1490},{"$f":"MIN(IFERROR(INT(LEFT(INDIRECT(\"Prices!C\"&AF12+1&\":C\"&AF13-2),\nFIND(\"-\",INDIRECT(\"Prices!C\"&AF12+1&\":C\"&AF13-2),1)-1)),99999))","v":148},{"$f":"MIN(IFERROR(INT(LEFT(INDIRECT(\"Prices!D\"&AF12+1&\":O\"&AF12+1),\nFIND(\"-\",INDIRECT(\"Prices!D\"&AF12+1&\":O\"&AF12+1),1)-1)),99999))","v":148},null,{"$f":"AA12","v":2},"J Handle Premium White Gloss"]
[null,"MELAMINE","E","NON MR","H1267","ST22","Woodgrain","Molina Sand","SE",null,"SE",null,null,null,null,null,null,null,5,null,6,null,null,null,null,null,3,{"$f":"INDIRECT(\"Prices!B\"&MATCH(AA13,Prices!$B$1:$B$10042,0)-1)","v":"J Handle Premium White"},{"$f":"\"Prices!C\"&AF13+1&\":T\"&AF14-3","v":"Prices!C35:T48"},"Prices!D35:T35","Prices!C36:C48",{"$f":"MATCH(AB13,Prices!B:B,0)+1","v":34},{"$f":"MAX(IFERROR(INT(RIGHT(INDIRECT(\"Prices!C\"&AF13+1&\":C\"&AF14-2),\nLEN(INDIRECT(\"Prices!C\"&AF13+1&\":C\"&AF14-2))-\nFIND(\"-\",INDIRECT(\"Prices!C\"&AF13+1&\":C\"&AF14-2),1))),0))","v":2790},{"$f":"MAX(IFERROR(INT(RIGHT(INDIRECT(\"Prices!D\"&AF13+1&\":O\"&AF13+1),\nLEN(INDIRECT(\"Prices!D\"&AF13+1&\":O\"&AF13+1))-\nFIND(\"-\",INDIRECT(\"Prices!D\"&AF13+1&\":O\"&AF13+1),1))),0))","v":1490},{"$f":"MIN(IFERROR(INT(LEFT(INDIRECT(\"Prices!C\"&AF13+1&\":C\"&AF14-2),\nFIND(\"-\",INDIRECT(\"Prices!C\"&AF13+1&\":C\"&AF14-2),1)-1)),99999))","v":148},{"$f":"MIN(IFERROR(INT(LEFT(INDIRECT(\"Prices!D\"&AF13+1&\":O\"&AF13+1),\nFIND(\"-\",INDIRECT(\"Prices!D\"&AF13+1&\":O\"&AF13+1),1)-1)),99999))","v":148},null,3,"J Handle Premium White"]
[null,"MELAMINE","E","NON MR","H1387","ST10","Woodgrain","Graphite Denver Oak","SE",null,"SE",null,null,null,null,null,null,null,5,null,6,null,null,null,null,null,4,{"$f":"INDIRECT(\"Prices!B\"&MATCH(AA14,Prices!$B$1:$B$10042,0)-1)","v":"J Handle Perfect Sense"},"Prices!C52:T65","Prices!D52:T52","Prices!C53:C65",{"$f":"MATCH(AB14,Prices!B:B,0)+1","v":51},{"$f":"MAX(IFERROR(INT(RIGHT(INDIRECT(\"Prices!C\"&AF14+1&\":C\"&AF15-2),\nLEN(INDIRECT(\"Prices!C\"&AF14+1&\":C\"&AF15-2))-\nFIND(\"-\",INDIRECT(\"Prices!C\"&AF14+1&\":C\"&AF15-2),1))),0))","v":2790},{"$f":"MAX(IFERROR(INT(RIGHT(INDIRECT(\"Prices!D\"&AF14+1&\":Q\"&AF14+1),\nLEN(INDIRECT(\"Prices!D\"&AF14+1&\":Q\"&AF14+1))-\nFIND(\"-\",INDIRECT(\"Prices!D\"&AF14+1&\":Q\"&AF14+1),1))),0))","v":1490},{"$f":"MIN(IFERROR(INT(LEFT(INDIRECT(\"Prices!C\"&AF14+1&\":C\"&AF15-2),\nFIND(\"-\",INDIRECT(\"Prices!C\"&AF14+1&\":C\"&AF15-2),1)-1)),99999))","v":148},{"$f":"MIN(IFERROR(INT(LEFT(INDIRECT(\"Prices!D\"&AF14+1&\":O\"&AF14+1),\nFIND(\"-\",INDIRECT(\"Prices!D\"&AF14+1&\":O\"&AF14+1),1)-1)),99999))","v":148},null,4,"J Handle Perfect Sense"]
[null,"MELAMINE","E","NON MR","H3077","ST22","Woodgrain","Ceramic Grey","SE",null,"SE",null,null,null,null,null,null,null,5,null,6,null,null,null,null,null,5,{"$f":"INDIRECT(\"Prices!B\"&MATCH(AA15,Prices!$B$1:$B$10042,0)-1)","v":"Wardrobe Range 16mm"},{"$f":"\"Prices!C\"&AF15+1&\":Q\"&AF16-3","v":"Prices!C69:Q80"},{"$f":"\"Prices!D\"&AF15+1&\":Q\"&AF15+1","v":"Prices!D69:Q69"},"Prices!C70:C80",{"$f":"MATCH(AB15,Prices!B:B,0)+1","v":68},{"$f":"MAX(IFERROR(INT(RIGHT(INDIRECT(\"Prices!C\"&AF15+1&\":C\"&AF16-2),\nLEN(INDIRECT(\"Prices!C\"&AF15+1&\":C\"&AF16-2))-\nFIND(\"-\",INDIRECT(\"Prices!C\"&AF15+1&\":C\"&AF16-2),1))),0))","v":2780},{"$f":"MAX(IFERROR(INT(RIGHT(INDIRECT(\"Prices!D\"&AF15+1&\":Q\"&AF15+1),\nLEN(INDIRECT(\"Prices!D\"&AF15+1&\":Q\"&AF15+1))-\nFIND(\"-\",INDIRECT(\"Prices!D\"&AF15+1&\":Q\"&AF15+1),1))),0))","v":2000},{"$f":"MIN(IFERROR(INT(LEFT(INDIRECT(\"Prices!C\"&AF15+1&\":C\"&AF16-2),\nFIND(\"-\",INDIRECT(\"Prices!C\"&AF15+1&\":C\"&AF16-2),1)-1)),99999))","v":80},{"$f":"MIN(IFERROR(INT(LEFT(INDIRECT(\"Prices!D\"&AF15+1&\":O\"&AF15+1),\nFIND(\"-\",INDIRECT(\"Prices!D\"&AF15+1&\":O\"&AF15+1),1)-1)),99999))","v":80},null,5,"Wardrobe Range 16mm"]
[null,"MELAMINE","E","NON MR","H3078","ST22","Woodgrain","Hacienda White","SE",null,"SE",null,null,null,null,null,null,null,5,null,6,null,null,null,null,null,6,{"$f":"INDIRECT(\"Prices!B\"&MATCH(AA16,Prices!$B$1:$B$10042,0)-1)","v":"Wardrobe Range 25mm"},{"$f":"\"Prices!C\"&AF16+1&\":Q\"&AF17-3","v":"Prices!C84:Q95"},{"$f":"\"Prices!D\"&AF16+1&\":Q\"&AF16+1","v":"Prices!D84:Q84"},"Prices!C85:C95",{"$f":"MATCH(AB16,Prices!B:B,0)+1","v":83},{"$f":"MAX(IFERROR(INT(RIGHT(INDIRECT(\"Prices!C\"&AF16+1&\":C\"&AF17-2),\nLEN(INDIRECT(\"Prices!C\"&AF16+1&\":C\"&AF17-2))-\nFIND(\"-\",INDIRECT(\"Prices!C\"&AF16+1&\":C\"&AF17-2),1))),0))","v":2780},{"$f":"MAX(IFERROR(INT(RIGHT(INDIRECT(\"Prices!D\"&AF16+1&\":Q\"&AF16+1),\nLEN(INDIRECT(\"Prices!D\"&AF16+1&\":Q\"&AF16+1))-\nFIND(\"-\",INDIRECT(\"Prices!D\"&AF16+1&\":Q\"&AF16+1),1))),0))","v":2000},{"$f":"MIN(IFERROR(INT(LEFT(INDIRECT(\"Prices!C\"&AF16+1&\":C\"&AF17-2),\nFIND(\"-\",INDIRECT(\"Prices!C\"&AF16+1&\":C\"&AF17-2),1)-1)),99999))","v":80},{"$f":"MIN(IFERROR(INT(LEFT(INDIRECT(\"Prices!D\"&AF16+1&\":O\"&AF16+1),\nFIND(\"-\",INDIRECT(\"Prices!D\"&AF16+1&\":O\"&AF16+1),1)-1)),99999))","v":80},null,6,"Wardrobe Range 25mm"]
[null,"MELAMINE","E","NON MR","H3081","ST22","Woodgrain","Hacienda Black","SE",null,"SE",null,null,null,null,null,null,null,5,null,6,null,null,null,null,null,7,{"$f":"INDIRECT(\"Prices!B\"&MATCH(AA17,Prices!$B$1:$B$10042,0)-1)","v":"Melamine Plain (Essential Range) 8x4 16mm"},"Prices!C99:Q109","Prices!D99:Q99","Prices!C100:C109",{"$f":"MATCH(AB17,Prices!B:B,0)+1","v":98},{"$f":"MAX(IFERROR(INT(RIGHT(INDIRECT(\"Prices!C\"&AF17+1&\":C\"&AF18-2),\nLEN(INDIRECT(\"Prices!C\"&AF17+1&\":C\"&AF18-2))-\nFIND(\"-\",INDIRECT(\"Prices!C\"&AF17+1&\":C\"&AF18-2),1))),0))","v":2400},{"$f":"MAX(IFERROR(INT(RIGHT(INDIRECT(\"Prices!D\"&AF17+1&\":Q\"&AF17+1),\nLEN(INDIRECT(\"Prices!D\"&AF17+1&\":Q\"&AF17+1))-\nFIND(\"-\",INDIRECT(\"Prices!D\"&AF17+1&\":Q\"&AF17+1),1))),0))","v":1200},{"$f":"MIN(IFERROR(INT(LEFT(INDIRECT(\"Prices!C\"&AF17+1&\":C\"&AF18-2),\nFIND(\"-\",INDIRECT(\"Prices!C\"&AF17+1&\":C\"&AF18-2),1)-1)),99999))","v":80},{"$f":"MIN(IFERROR(INT(LEFT(INDIRECT(\"Prices!D\"&AF17+1&\":O\"&AF17+1),\nFIND(\"-\",INDIRECT(\"Prices!D\"&AF17+1&\":O\"&AF17+1),1)-1)),99999))","v":80},null,7,"Melamine Plain (Essential Range) 8x4 16mm"]
[null,"MELAMINE","E","NON MR","H3155","ST10","Woodgrain","Tobacco Charleston","SE",null,"SE",null,null,null,null,null,null,null,5,null,6,null,null,null,null,null,8,{"$f":"INDIRECT(\"Prices!B\"&MATCH(AA18,Prices!$B$1:$B$10042,0)-1)","v":"Melamine Plain (Essential Range) Jumbo 16mm"},"Prices!C113:Q124","Prices!D113:Q113","Prices!C114:C124",{"$f":"MATCH(AB18,Prices!B:B,0)+1","v":112},{"$f":"MAX(IFERROR(INT(RIGHT(INDIRECT(\"Prices!C\"&AF18+1&\":C\"&AF19-2),\nLEN(INDIRECT(\"Prices!C\"&AF18+1&\":C\"&AF19-2))-\nFIND(\"-\",INDIRECT(\"Prices!C\"&AF18+1&\":C\"&AF19-2),1))),0))","v":2780},{"$f":"MAX(IFERROR(INT(RIGHT(INDIRECT(\"Prices!D\"&AF18+1&\":Q\"&AF18+1),\nLEN(INDIRECT(\"Prices!D\"&AF18+1&\":Q\"&AF18+1))-\nFIND(\"-\",INDIRECT(\"Prices!D\"&AF18+1&\":Q\"&AF18+1),1))),0))","v":2000},{"$f":"MIN(IFERROR(INT(LEFT(INDIRECT(\"Prices!C\"&AF18+1&\":C\"&AF19-2),\nFIND(\"-\",INDIRECT(\"Prices!C\"&AF18+1&\":C\"&AF19-2),1)-1)),99999))","v":80},{"$f":"MIN(IFERROR(INT(LEFT(INDIRECT(\"Prices!D\"&AF18+1&\":O\"&AF18+1),\nFIND(\"-\",INDIRECT(\"Prices!D\"&AF18+1&\":O\"&AF18+1),1)-1)),99999))","v":80},null,8,"Melamine Plain (Essential Range) Jumbo 16mm"]
[null,"MELAMINE","E","NON MR","H3303","ST22","Woodgrain","Natural Arlington Oak","SE",null,"SE",null,null,null,null,null,null,null,5,null,6,null,null,null,null,null,9,{"$f":"INDIRECT(\"Prices!B\"&MATCH(AA19,Prices!$B$1:$B$10042,0)-1)","v":"Melamine Plain (Builders & Zoom) 16mm"},"Prices!C128:Q139","Prices!D128:Q128","Prices!C129:C139",{"$f":"MATCH(AB19,Prices!B:B,0)+1","v":127},{"$f":"MAX(IFERROR(INT(RIGHT(INDIRECT(\"Prices!C\"&AF19+1&\":C\"&AF20-2),\nLEN(INDIRECT(\"Prices!C\"&AF19+1&\":C\"&AF20-2))-\nFIND(\"-\",INDIRECT(\"Prices!C\"&AF19+1&\":C\"&AF20-2),1))),0))","v":2780},{"$f":"MAX(IFERROR(INT(RIGHT(INDIRECT(\"Prices!D\"&AF19+1&\":Q\"&AF19+1),\nLEN(INDIRECT(\"Prices!D\"&AF19+1&\":Q\"&AF19+1))-\nFIND(\"-\",INDIRECT(\"Prices!D\"&AF19+1&\":Q\"&AF19+1),1))),0))","v":2000},{"$f":"MIN(IFERROR(INT(LEFT(INDIRECT(\"Prices!C\"&AF19+1&\":C\"&AF20-2),\nFIND(\"-\",INDIRECT(\"Prices!C\"&AF19+1&\":C\"&AF20-2),1)-1)),99999))","v":80},{"$f":"MIN(IFERROR(INT(LEFT(INDIRECT(\"Prices!D\"&AF19+1&\":O\"&AF19+1),\nFIND(\"-\",INDIRECT(\"Prices!D\"&AF19+1&\":O\"&AF19+1),1)-1)),99999))","v":80},null,9,"Melamine Plain (Builders & Zoom) 16mm"]
[null,"MELAMINE","K","MR",9010,"BS","Plain","Oxford Grey","CE",null,null,null,null,null,null,null,null,null,7,null,null,null,null,null,null,null,10,{"$f":"INDIRECT(\"Prices!B\"&MATCH(AA20,Prices!$B$1:$B$10042,0)-1)","v":"Melamine Woodgrain (Builders, Zoom & Essential) 16mm"},"Prices!C143:Q154","Prices!D143:Q143","Prices!C144:C154",{"$f":"MATCH(AB20,Prices!B:B,0)+1","v":142},{"$f":"MAX(IFERROR(INT(RIGHT(INDIRECT(\"Prices!C\"&AF20+1&\":C\"&AF21-2),\nLEN(INDIRECT(\"Prices!C\"&AF20+1&\":C\"&AF21-2))-\nFIND(\"-\",INDIRECT(\"Prices!C\"&AF20+1&\":C\"&AF21-2),1))),0))","v":2780},{"$f":"MAX(IFERROR(INT(RIGHT(INDIRECT(\"Prices!D\"&AF20+1&\":Q\"&AF20+1),\nLEN(INDIRECT(\"Prices!D\"&AF20+1&\":Q\"&AF20+1))-\nFIND(\"-\",INDIRECT(\"Prices!D\"&AF20+1&\":Q\"&AF20+1),1))),0))","v":2000},{"$f":"MIN(IFERROR(INT(LEFT(INDIRECT(\"Prices!C\"&AF20+1&\":C\"&AF21-2),\nFIND(\"-\",INDIRECT(\"Prices!C\"&AF20+1&\":C\"&AF21-2),1)-1)),99999))","v":80},{"$f":"MIN(IFERROR(INT(LEFT(INDIRECT(\"Prices!D\"&AF20+1&\":O\"&AF20+1),\nFIND(\"-\",INDIRECT(\"Prices!D\"&AF20+1&\":O\"&AF20+1),1)-1)),99999))","v":80},null,10,"Melamine Woodgrain (Builders, Zoom & Essential) 16mm"]
[null,"MELAMINE","K","MR",9011,"BS","Plain","Tin Grey","CE",null,null,null,null,null,null,null,null,null,7,null,null,null,null,null,null,null,11,{"$f":"INDIRECT(\"Prices!B\"&MATCH(AA21,Prices!$B$1:$B$10042,0)-1)","v":"Melamine Fantasy & ST30 16mm"},"Prices!C158:Q169","Prices!D158:Q158","Prices!C159:C169",{"$f":"MATCH(AB21,Prices!B:B,0)+1","v":157},{"$f":"MAX(IFERROR(INT(RIGHT(INDIRECT(\"Prices!C\"&AF21+1&\":C\"&AF22-2),\nLEN(INDIRECT(\"Prices!C\"&AF21+1&\":C\"&AF22-2))-\nFIND(\"-\",INDIRECT(\"Prices!C\"&AF21+1&\":C\"&AF22-2),1))),0))","v":2780},{"$f":"MAX(IFERROR(INT(RIGHT(INDIRECT(\"Prices!D\"&AF21+1&\":Q\"&AF21+1),\nLEN(INDIRECT(\"Prices!D\"&AF21+1&\":Q\"&AF21+1))-\nFIND(\"-\",INDIRECT(\"Prices!D\"&AF21+1&\":Q\"&AF21+1),1))),0))","v":2000},{"$f":"MIN(IFERROR(INT(LEFT(INDIRECT(\"Prices!C\"&AF21+1&\":C\"&AF22-2),\nFIND(\"-\",INDIRECT(\"Prices!C\"&AF21+1&\":C\"&AF22-2),1)-1)),99999))","v":80},{"$f":"MIN(IFERROR(INT(LEFT(INDIRECT(\"Prices!D\"&AF21+1&\":O\"&AF21+1),\nFIND(\"-\",INDIRECT(\"Prices!D\"&AF21+1&\":O\"&AF21+1),1)-1)),99999))","v":80},null,11,"Melamine Fantasy & ST30 16mm"]
[null,"MELAMINE","K","MR",9012,"BS","Plain","Seattle Grey","CE",null,null,null,null,null,null,null,null,null,7,null,null,null,null,null,null,null,12,{"$f":"INDIRECT(\"Prices!B\"&MATCH(AA22,Prices!$B$1:$B$10042,0)-1)","v":"Melamine Mattwood 18mm"},"Prices!C173:Q184","Prices!D173:Q173","Prices!C174:C184",{"$f":"MATCH(AB22,Prices!B:B,0)+1","v":172},{"$f":"MAX(IFERROR(INT(RIGHT(INDIRECT(\"Prices!C\"&AF22+1&\":C\"&AF23-2),\nLEN(INDIRECT(\"Prices!C\"&AF22+1&\":C\"&AF23-2))-\nFIND(\"-\",INDIRECT(\"Prices!C\"&AF22+1&\":C\"&AF23-2),1))),0))","v":2800},{"$f":"MAX(IFERROR(INT(RIGHT(INDIRECT(\"Prices!D\"&AF22+1&\":Q\"&AF22+1),\nLEN(INDIRECT(\"Prices!D\"&AF22+1&\":Q\"&AF22+1))-\nFIND(\"-\",INDIRECT(\"Prices!D\"&AF22+1&\":Q\"&AF22+1),1))),0))","v":2000},{"$f":"MIN(IFERROR(INT(LEFT(INDIRECT(\"Prices!C\"&AF22+1&\":C\"&AF23-2),\nFIND(\"-\",INDIRECT(\"Prices!C\"&AF22+1&\":C\"&AF23-2),1)-1)),99999))","v":80},{"$f":"MIN(IFERROR(INT(LEFT(INDIRECT(\"Prices!D\"&AF22+1&\":O\"&AF22+1),\nFIND(\"-\",INDIRECT(\"Prices!D\"&AF22+1&\":O\"&AF22+1),1)-1)),99999))","v":80},null,12,"Melamine Mattwood 18mm"]
[null,"MELAMINE","K","MR",9013,"BS","Plain","Taupe Beige","CE",null,null,null,null,null,null,null,null,null,7,null,null,null,null,null,null,null,13,{"$f":"INDIRECT(\"Prices!B\"&MATCH(AA23,Prices!$B$1:$B$10042,0)-1)","v":"Melamine Mattwood 25mm"},"Prices!C188:Q199","Prices!D188:Q188","Prices!C189:C199",{"$f":"MATCH(AB23,Prices!B:B,0)+1","v":187},{"$f":"MAX(IFERROR(INT(RIGHT(INDIRECT(\"Prices!C\"&AF23+1&\":C\"&AF24-2),\nLEN(INDIRECT(\"Prices!C\"&AF23+1&\":C\"&AF24-2))-\nFIND(\"-\",INDIRECT(\"Prices!C\"&AF23+1&\":C\"&AF24-2),1))),0))","v":2780},{"$f":"MAX(IFERROR(INT(RIGHT(INDIRECT(\"Prices!D\"&AF23+1&\":Q\"&AF23+1),\nLEN(INDIRECT(\"Prices!D\"&AF23+1&\":Q\"&AF23+1))-\nFIND(\"-\",INDIRECT(\"Prices!D\"&AF23+1&\":Q\"&AF23+1),1))),0))","v":2000},{"$f":"MIN(IFERROR(INT(LEFT(INDIRECT(\"Prices!C\"&AF23+1&\":C\"&AF24-2),\nFIND(\"-\",INDIRECT(\"Prices!C\"&AF23+1&\":C\"&AF24-2),1)-1)),99999))","v":80},{"$f":"MIN(IFERROR(INT(LEFT(INDIRECT(\"Prices!D\"&AF23+1&\":O\"&AF23+1),\nFIND(\"-\",INDIRECT(\"Prices!D\"&AF23+1&\":O\"&AF23+1),1)-1)),99999))","v":80},null,13,"Melamine Mattwood 25mm"]
[null,"MELAMINE","K","MR",9014,"BS","Plain","Cotton White","CE",null,null,null,null,null,null,null,null,null,7,null,null,null,null,null,null,null,14,{"$f":"INDIRECT(\"Prices!B\"&MATCH(AA24,Prices!$B$1:$B$10042,0)-1)","v":"Melamine Feelwood 18mm"},"Prices!C203:Q214","Prices!D203:Q203","Prices!C204:C214",{"$f":"MATCH(AB24,Prices!B:B,0)+1","v":202},{"$f":"MAX(IFERROR(INT(RIGHT(INDIRECT(\"Prices!C\"&AF24+1&\":C\"&AF25-2),\nLEN(INDIRECT(\"Prices!C\"&AF24+1&\":C\"&AF25-2))-\nFIND(\"-\",INDIRECT(\"Prices!C\"&AF24+1&\":C\"&AF25-2),1))),0))","v":2800},{"$f":"MAX(IFERROR(INT(RIGHT(INDIRECT(\"Prices!D\"&AF24+1&\":Q\"&AF24+1),\nLEN(INDIRECT(\"Prices!D\"&AF24+1&\":Q\"&AF24+1))-\nFIND(\"-\",INDIRECT(\"Prices!D\"&AF24+1&\":Q\"&AF24+1),1))),0))","v":2000},{"$f":"MIN(IFERROR(INT(LEFT(INDIRECT(\"Prices!C\"&AF24+1&\":C\"&AF25-2),\nFIND(\"-\",INDIRECT(\"Prices!C\"&AF24+1&\":C\"&AF25-2),1)-1)),99999))","v":80},{"$f":"MIN(IFERROR(INT(LEFT(INDIRECT(\"Prices!D\"&AF24+1&\":O\"&AF24+1),\nFIND(\"-\",INDIRECT(\"Prices!D\"&AF24+1&\":O\"&AF24+1),1)-1)),99999))","v":80},null,14,"Melamine Feelwood 18mm"]
[null,"MELAMINE","K","MR",9015,"BS","Plain","Powder White","CE",null,null,null,null,null,null,null,null,null,7,null,null,null,null,null,null,null,15,{"$f":"INDIRECT(\"Prices!B\"&MATCH(AA25,Prices!$B$1:$B$10042,0)-1)","v":"Melamine Feelwood 25mm"},"Prices!C218:Q229","Prices!D218:Q218","Prices!C219:C229",{"$f":"MATCH(AB25,Prices!B:B,0)+1","v":217},{"$f":"MAX(IFERROR(INT(RIGHT(INDIRECT(\"Prices!C\"&AF25+1&\":C\"&AF26-2),\nLEN(INDIRECT(\"Prices!C\"&AF25+1&\":C\"&AF26-2))-\nFIND(\"-\",INDIRECT(\"Prices!C\"&AF25+1&\":C\"&AF26-2),1))),0))","v":2780},{"$f":"MAX(IFERROR(INT(RIGHT(INDIRECT(\"Prices!D\"&AF25+1&\":Q\"&AF25+1),\nLEN(INDIRECT(\"Prices!D\"&AF25+1&\":Q\"&AF25+1))-\nFIND(\"-\",INDIRECT(\"Prices!D\"&AF25+1&\":Q\"&AF25+1),1))),0))","v":2000},{"$f":"MIN(IFERROR(INT(LEFT(INDIRECT(\"Prices!C\"&AF25+1&\":C\"&AF26-2),\nFIND(\"-\",INDIRECT(\"Prices!C\"&AF25+1&\":C\"&AF26-2),1)-1)),99999))","v":80},{"$f":"MIN(IFERROR(INT(LEFT(INDIRECT(\"Prices!D\"&AF25+1&\":O\"&AF25+1),\nFIND(\"-\",INDIRECT(\"Prices!D\"&AF25+1&\":O\"&AF25+1),1)-1)),99999))","v":80},null,15,"Melamine Feelwood 25mm"]
[null,"MELAMINE","K","MR",9016,"BS","Plain","Mineral Green","CE",null,null,null,null,null,null,null,null,null,7,null,null,null,null,null,null,null,16,{"$f":"INDIRECT(\"Prices!B\"&MATCH(AA26,Prices!$B$1:$B$10042,0)-1)","v":"PerfectSense Matt & Gloss 18mm"},{"$f":"\"Prices!C\"&AF26+1&\":N\"&AF27-3","v":"Prices!C233:N244"},{"$f":"\"Prices!D\"&AF26+1&\":N\"&AF26+1","v":"Prices!D233:N233"},"Prices!C234:C244",{"$f":"MATCH(AB26,Prices!B:B,0)+1","v":232},{"$f":"MAX(IFERROR(INT(RIGHT(INDIRECT(\"Prices!C\"&AF26+1&\":C\"&AF27-2),\nLEN(INDIRECT(\"Prices!C\"&AF26+1&\":C\"&AF27-2))-\nFIND(\"-\",INDIRECT(\"Prices!C\"&AF26+1&\":C\"&AF27-2),1))),0))","v":2780},{"$f":"MAX(IFERROR(INT(RIGHT(INDIRECT(\"Prices!D\"&AF26+1&\":Q\"&AF26+1),\nLEN(INDIRECT(\"Prices!D\"&AF26+1&\":Q\"&AF26+1))-\nFIND(\"-\",INDIRECT(\"Prices!D\"&AF26+1&\":Q\"&AF26+1),1))),0))","v":2000},{"$f":"MIN(IFERROR(INT(LEFT(INDIRECT(\"Prices!C\"&AF26+1&\":C\"&AF27-2),\nFIND(\"-\",INDIRECT(\"Prices!C\"&AF26+1&\":C\"&AF27-2),1)-1)),99999))","v":80},{"$f":"MIN(IFERROR(INT(LEFT(INDIRECT(\"Prices!D\"&AF26+1&\":O\"&AF26+1),\nFIND(\"-\",INDIRECT(\"Prices!D\"&AF26+1&\":O\"&AF26+1),1)-1)),99999))","v":80},null,16,"PerfectSense Matt & Gloss 18mm"]
[null,"MELAMINE","K","MR",9017,"BS","Plain","Black","CE",null,null,null,null,null,null,null,null,null,7,null,null,null,null,null,null,null,17,{"$f":"INDIRECT(\"Prices!B\"&MATCH(AA27,Prices!$B$1:$B$10042,0)-1)","v":"Acrylic Crisp White Single Sided 18mm"},{"$f":"\"Prices!C\"&AF27+1&\":N\"&AF28-3","v":"Prices!C248:N259"},{"$f":"\"Prices!D\"&AF27+1&\":N\"&AF27+1","v":"Prices!D248:N248"},"Prices!C249:C259",{"$f":"MATCH(AB27,Prices!B:B,0)+1","v":247},{"$f":"MAX(IFERROR(INT(RIGHT(INDIRECT(\"Prices!C\"&AF27+1&\":C\"&AF28-2),\nLEN(INDIRECT(\"Prices!C\"&AF27+1&\":C\"&AF28-2))-\nFIND(\"-\",INDIRECT(\"Prices!C\"&AF27+1&\":C\"&AF28-2),1))),0))","v":2780},{"$f":"MAX(IFERROR(INT(RIGHT(INDIRECT(\"Prices!D\"&AF27+1&\":Q\"&AF27+1),\nLEN(INDIRECT(\"Prices!D\"&AF27+1&\":Q\"&AF27+1))-\nFIND(\"-\",INDIRECT(\"Prices!D\"&AF27+1&\":Q\"&AF27+1),1))),0))","v":1200},{"$f":"MIN(IFERROR(INT(LEFT(INDIRECT(\"Prices!C\"&AF27+1&\":C\"&AF28-2),\nFIND(\"-\",INDIRECT(\"Prices!C\"&AF27+1&\":C\"&AF28-2),1)-1)),99999))","v":80},{"$f":"MIN(IFERROR(INT(LEFT(INDIRECT(\"Prices!D\"&AF27+1&\":O\"&AF27+1),\nFIND(\"-\",INDIRECT(\"Prices!D\"&AF27+1&\":O\"&AF27+1),1)-1)),99999))","v":80},null,17,"Acrylic Crisp White Single Sided 18mm"]
[null,"MELAMINE","K","MR",9010,"SU","Plain","Oxford Grey","CE",null,null,null,null,null,null,null,null,null,8,null,null,null,null,null,null,null,18,{"$f":"INDIRECT(\"Prices!B\"&MATCH(AA28,Prices!$B$1:$B$10042,0)-1)","v":"Acrylic Pure White Single Sided 18mm"},"Prices!C263:N274","Prices!D263:N263","Prices!C264:C274",{"$f":"MATCH(AB28,Prices!B:B,0)+1","v":262},{"$f":"MAX(IFERROR(INT(RIGHT(INDIRECT(\"Prices!C\"&AF28+1&\":C\"&AF29-2),\nLEN(INDIRECT(\"Prices!C\"&AF28+1&\":C\"&AF29-2))-\nFIND(\"-\",INDIRECT(\"Prices!C\"&AF28+1&\":C\"&AF29-2),1))),0))","v":2780},{"$f":"MAX(IFERROR(INT(RIGHT(INDIRECT(\"Prices!D\"&AF28+1&\":Q\"&AF28+1),\nLEN(INDIRECT(\"Prices!D\"&AF28+1&\":Q\"&AF28+1))-\nFIND(\"-\",INDIRECT(\"Prices!D\"&AF28+1&\":Q\"&AF28+1),1))),0))","v":1200},{"$f":"MIN(IFERROR(INT(LEFT(INDIRECT(\"Prices!C\"&AF28+1&\":C\"&AF29-2),\nFIND(\"-\",INDIRECT(\"Prices!C\"&AF28+1&\":C\"&AF29-2),1)-1)),99999))","v":80},{"$f":"MIN(IFERROR(INT(LEFT(INDIRECT(\"Prices!D\"&AF28+1&\":O\"&AF28+1),\nFIND(\"-\",INDIRECT(\"Prices!D\"&AF28+1&\":O\"&AF28+1),1)-1)),99999))","v":80},null,18,"Acrylic Pure White Single Sided 18mm"]
[null,"MELAMINE","K","MR",9011,"SU","Plain","Tin Grey","CE",null,null,null,null,null,null,null,null,null,8,null,null,null,null,null,null,null,19,{"$f":"INDIRECT(\"Prices!B\"&MATCH(AA29,Prices!$B$1:$B$10042,0)-1)","v":"Acrylic Pure White Double Sided 18mm"},"Prices!C278:N289","Prices!D278:N278","Prices!C279:C289",{"$f":"MATCH(AB29,Prices!B:B,0)+1","v":277},{"$f":"MAX(IFERROR(INT(RIGHT(INDIRECT(\"Prices!C\"&AF29+1&\":C\"&AF30-2),\nLEN(INDIRECT(\"Prices!C\"&AF29+1&\":C\"&AF30-2))-\nFIND(\"-\",INDIRECT(\"Prices!C\"&AF29+1&\":C\"&AF30-2),1))),0))","v":2780},{"$f":"MAX(IFERROR(INT(RIGHT(INDIRECT(\"Prices!D\"&AF29+1&\":Q\"&AF29+1),\nLEN(INDIRECT(\"Prices!D\"&AF29+1&\":Q\"&AF29+1))-\nFIND(\"-\",INDIRECT(\"Prices!D\"&AF29+1&\":Q\"&AF29+1),1))),0))","v":1200},{"$f":"MIN(IFERROR(INT(LEFT(INDIRECT(\"Prices!C\"&AF29+1&\":C\"&AF30-2),\nFIND(\"-\",INDIRECT(\"Prices!C\"&AF29+1&\":C\"&AF30-2),1)-1)),99999))","v":80},{"$f":"MIN(IFERROR(INT(LEFT(INDIRECT(\"Prices!D\"&AF29+1&\":O\"&AF29+1),\nFIND(\"-\",INDIRECT(\"Prices!D\"&AF29+1&\":O\"&AF29+1),1)-1)),99999))","v":80},null,19,"Acrylic Pure White Double Sided 18mm"]
[null,"MELAMINE","K","MR",9012,"SU","Plain","Seattle Grey","CE",null,null,null,null,null,null,null,null,null,8,null,null,null,null,null,null,null,20,{"$f":"INDIRECT(\"Prices!B\"&MATCH(AA30,Prices!$B$1:$B$10042,0)-1)","v":"Meraki 18mm Double Sided"},"Prices!C293:N304",{"$f":"\"Prices!D\"&AF30+1&\":N\"&AF30+1","v":"Prices!D293:N293"},{"$f":"\"Prices!C\"&AF30+2&\":C\"&AF31-3","v":"Prices!C294:C304"},{"$f":"MATCH(AB30,Prices!B:B,0)+1","v":292},{"$f":"MAX(IFERROR(INT(RIGHT(INDIRECT(\"Prices!C\"&AF30+1&\":C\"&AF31-2),\nLEN(INDIRECT(\"Prices!C\"&AF30+1&\":C\"&AF31-2))-\nFIND(\"-\",INDIRECT(\"Prices!C\"&AF30+1&\":C\"&AF31-2),1))),0))","v":2780},{"$f":"MAX(IFERROR(INT(RIGHT(INDIRECT(\"Prices!D\"&AF30+1&\":Q\"&AF30+1),\nLEN(INDIRECT(\"Prices!D\"&AF30+1&\":Q\"&AF30+1))-\nFIND(\"-\",INDIRECT(\"Prices!D\"&AF30+1&\":Q\"&AF30+1),1))),0))","v":1200},80,80,"Keep Eurolight always last",20,"Meraki 18mm Double Sided"]
[null,"MELAMINE","K","MR",9013,"SU","Plain","Taupe Beige","CE",null,null,null,null,null,null,null,null,null,8,null,null,null,null,null,null,null,21,{"$f":"INDIRECT(\"Prices!B\"&MATCH(AA31,Prices!$B$1:$B$10042,0)-1)","v":"50mm Eurolight (price per sq metre)"},{"$f":"\"Prices!B\"&AF31+1","v":"Prices!B308"},null,null,{"$f":"MATCH(AB31,Prices!B:B,0)+1","v":307},null,null,null,null,null,21,"50mm Eurolight (price per sq metre)"]
[null,"MELAMINE","K","MR",9014,"SU","Plain","Cotton White","CE",null,null,null,null,null,null,null,null,null,8]
[null,"MELAMINE","K","MR",9015,"SU","Plain","Powder White","CE",null,null,null,null,null,null,null,null,null,8]
[null,"MELAMINE","K","MR",9016,"SU","Plain","Mineral Green","CE",null,null,null,null,null,null,null,null,null,8]
[null,"MELAMINE","K","MR",9017,"SU","Plain","Black","CE",null,null,null,null,null,null,null,null,null,8]
[null,"MELAMINE","E","MR","U599","ST9","Plain","Indigo Blue","SE",null,null,null,null,null,null,null,null,null,9]
[null,"MELAMINE","E","MR","U727","ST9","Plain","Stone Grey","SE",null,null,null,"CE",null,null,null,null,null,9,null,null,null,21]
[null,"MELAMINE","E","MR","U732","ST9","Plain","Dust Grey","SE",null,null,null,null,null,null,null,null,null,9]
[null,"MELAMINE","E","MR","U750","ST9","Plain","Taupe Grey","SE",null,null,null,null,null,null,null,null,null,9]
[null,"MELAMINE","E","MR","U763","ST9","Plain","Pearl Grey","SE",null,null,null,null,null,null,null,null,null,9]
[null,"MELAMINE","E","MR","U775","ST9","Plain","White Grey","SE",null,null,null,null,null,null,null,null,null,9]
[null,"MELAMINE","E","MR","U960","ST9","Plain","Onyx Grey","SE",null,null,null,null,null,null,null,null,null,9]
[null,"MELAMINE","E","MR","U961","ST9","Plain","Graphite","SE",null,null,null,null,null,null,null,null,null,9]
[null,"MELAMINE","E","MR","U963","ST9","Plain","Diamond Grey","SE",null,null,null,null,null,null,null,null,null,9]
[null,"MELAMINE","E","MR","U999","ST9","Plain","Black","SE",null,null,null,null,null,null,null,null,null,9]
[null,"MELAMINE","E","MR","W980","ST2","Plain","Platium White","SE",null,null,null,"CE",null,null,null,null,null,9,null,null,null,21]
[null,"MELAMINE","E","MR","W1000","ST9","Plain","Premium White","SE",null,null,"SE","CE",null,null,null,null,null,9,null,null,3,21]
[null,"MELAMINE","E","MR","W1100","ST9","Plain","Alpine White","SE",null,null,null,null,null,null,null,null,null,9]
[null,"MELAMINE","E","MR","W1200","ST9","Plain","Porcelain","SE",null,null,null,null,null,null,null,null,null,9]
[null,"MELAMINE","E","MR","H1145","ST10","Woodgrain","Natural Bardolino Oak","SE",null,null,null,"CE",null,null,null,null,null,10,null,null,null,21]
[null,"MELAMINE","E","MR","H1146","ST10","Woodgrain","Grey Bardolino Oak","SE",null,null,null,null,null,null,null,null,null,10]
[null,"MELAMINE","E","MR","H1150","ST10","Woodgrain","Grey Authentic Oak","SE",null,null,null,null,null,null,null,null,null,10]
[null,"MELAMINE","E","MR","H1267","ST22","Woodgrain","Molina Sand","SE",null,null,null,null,null,null,null,null,null,10]
[null,"MELAMINE","E","MR","H1277","ST9","Woodgrain","Lakeland Acacia","SE",null,null,null,"CE",null,null,null,null,null,10,null,null,null,21]
[null,"MELAMINE","E","MR","H1334","ST9","Woodgrain","Light Ferrara Oak","SE",null,null,null,"CE",null,null,null,null,null,10,null,null,null,21]
[null,"MELAMINE","E","MR","H1387","ST10","Woodgrain","Graphite Denver Oak","SE",null,null,null,null,null,null,null,null,null,10]
[null,"MELAMINE","E","MR","H3058","ST22","Woodgrain","Mali Wenge","SE",null,null,null,"CE",null,null,null,null,null,10,null,null,null,21]
[null,"MELAMINE","E","MR","H3077","ST22","Woodgrain","Ceramic Grey","SE",null,null,null,null,null,null,null,null,null,10]
[null,"MELAMINE","E","MR","H3078","ST22","Woodgrain","Hacienda White","SE",null,null,null,"CE",null,null,null,null,null,10,null,null,null,21]
[null,"MELAMINE","E","MR","H3081","ST22","Woodgrain","Hacienda Black","SE",null,null,null,"CE",null,null,null,null,null,10,null,null,null,21]
[null,"MELAMINE","E","MR","H3155","ST10","Woodgrain","Tobacco Charleston","SE",null,null,null,null,null,null,null,null,null,10]
[null,"MELAMINE","E","MR","H3303","ST10","Woodgrain","Natural Arlington Oak","SE",null,null,null,null,null,null,null,null,null,10]
[null,"MELAMINE","E","MR","H3363","ST9","Woodgrain","Anthracite Highland","SE",null,null,null,null,null,null,null,null,null,10]
[null,"MELAMINE","K","MR",9100,"SN","Woodgrain","Black Pepper Wood","CE",null,null,null,null,null,null,null,null,null,10]
[null,"MELAMINE","K","MR",9101,"PW","Woodgrain","Alder Hickory Oak","CE",null,null,null,null,null,null,null,null,null,10]
[null,"MDF","E","MR","W103","ST30","Plain","Parchment","CE",null,null,null,null,null,null,null,null,null,11]
[null,"MDF","E","MR","W1000","ST30","Plain","Premium White","CE",null,null,"SE",null,null,null,null,null,null,11,null,null,2]
[null,"MELAMINE","E","MR","F426","ST10","Material Reproduction","Grey Linen","CE",null,null,null,null,null,null,null,null,null,11]
[null,"MELAMINE","E","MR","F638","ST16","Material Reproduction","Chromix Silver","CE",null,null,null,null,null,null,null,null,null,11]
[null,"MELAMINE","E","MR","F641","ST16","Material Reproduction","Chromix Anthracite","CE",null,null,null,null,null,null,null,null,null,11]
[null,"MELAMINE","K","MR",9001,"MW","Mattwood","Honey Stirling Oak",null,"CE","CE",null,null,null,null,null,null,null,null,12,13]
[null,"MELAMINE","K","MR",9002,"MW","Mattwood","Brown Stirling Oak",null,"CE","CE",null,null,null,null,null,null,null,null,12,13]
[null,"MELAMINE","K","MR",9003,"MW","Mattwood","Proserpine Walnut",null,"CE","CE",null,null,null,null,null,null,null,null,12,13]
[null,"MELAMINE","K","MR",9004,"MW","Mattwood","Kiandra Oak",null,"CE","CE",null,null,null,null,null,null,null,null,12,13]
[null,"MELAMINE","K","MR",9005,"MW","Mattwood","Grampian Elm",null,"CE","CE",null,null,null,null,null,null,null,null,12,13]
[null,"MELAMINE","K","MR",9006,"MW","Mattwood","Pemberton Walnut",null,"CE","CE",null,null,null,null,null,null,null,null,12,13]
[null,"MELAMINE","K","MR",9007,"MW","Mattwood","Macedon Oak",null,"CE","CE",null,null,null,null,null,null,null,null,12,13]
[null,"MELAMINE","K","MR",9008,"MW","Mattwood","Torrens Oak",null,"CE","CE",null,null,null,null,null,null,null,null,12,13]
[null,"MELAMINE","K","MR",9009,"MW","Mattwood","Moreton Elm",null,"CE","CE",null,null,null,null,null,null,null,null,12,13]
[null,"MELAMINE","E","MR","H1176","ST37","Feelwood","White Halifax Oak",null,"SE",null,null,null,null,null,null,null,null,null,14]
[null,"MELAMINE","E","MR","H1180","ST37","Feelwood","Natural Halifax Oak",null,"SE",null,null,null,null,null,null,null,null,null,14]
[null,"MELAMINE","E","MR","H1377","ST36","Feelwood","Sand Orleans Oak",null,"SE",null,null,null,null,null,null,null,null,null,14]
[null,"MELAMINE","E","MR","H1379","ST36","Feelwood","Brown Orleans Oak",null,"SE",null,null,null,null,null,null,null,null,null,14]
[null,"MELAMINE","E","MR","H1486","ST36","Feelwood","Jackson Pine",null,"SE","SE",null,null,null,null,null,null,null,null,14,15]
[null,"MELAMINE","E","MR","H3325","ST28","Feelwood","Tobacco Gladstone Oak",null,"SE","SE",null,null,null,null,null,null,null,null,14,15]
[null,"MELAMINE","E","MR","H3326","ST28","Feelwood","Grey Beige Gladstone Oak",null,"SE","SE","SE",null,null,null,null,null,null,null,14,15,1]
[null,"MELAMINE","E","MR","H3760","ST29","Feelwood","White Cape Elm",null,"SE","SE",null,null,null,null,null,null,null,null,14,15]
[null,"MELAMINE","E","MR","H3766","ST29","Feelwood","Dark Brown Cape Elm",null,"SE","SE",null,null,null,null,null,null,null,null,14,15]
[null,"MELAMINE","E","MR","U999","ST38","Feelwood","Black Feelwood",null,"SE",null,null,null,null,null,null,null,null,null,14]
[null,"MDF","E","MR","U599","PM","Perfectsense","Indigo Blue",null,"CE",null,null,null,null,null,null,null,null,null,16]
[null,"MDF","E","MR","U702","PM","Perfectsense","Cashmere",null,"CE",null,null,null,null,null,null,null,null,null,16]
[null,"MDF","E","MR","U727","PM","Perfectsense","Stone Grey",null,"CE",null,null,null,null,null,null,null,null,null,16]
[null,"MDF","E","MR","U732","PM","Perfectsense","Dust Grey",null,"CE",null,null,null,null,null,null,null,null,null,16]
[null,"MDF","E","MR","U763","PM","Perfectsense","Pearl Grey",null,"CE",null,null,null,null,null,null,null,null,null,16]
[null,"MDF","E","MR","U775","PM","Perfectsense","White Grey",null,"CE",null,null,null,null,null,null,null,null,null,16]
[null,"MDF","E","MR","U960","PM","Perfectsense","Onyx Grey",null,"CE",null,null,null,null,null,null,null,null,null,16]
[null,"MDF","E","MR","U961","PM","Perfectsense","Graphite",null,"CE",null,null,null,null,null,null,null,null,null,16]
[null,"MDF","E","MR","U999","PM","Perfectsense","Black",null,"CE",null,"SE",null,null,null,null,null,null,null,16,null,4]
[null,"MDF","E","MR","W1000","PM","Perfectsense","Premium White",null,"CE",null,"SE",null,null,null,null,null,null,null,16,null,4]
[null,"MDF","E","MR","W1100","PM","Perfectsense","Alpine White",null,"CE",null,null,null,null,null,null,null,null,null,16,null,null,null,null,null,null,null,null,null,null,null,null,null,{"$f":"$I$7&\" \"&$J$9&\" \"&E100&\" \"&G100&\" \"&H100","v":"Melamine 18mm W1100 Perfectsense Alpine White"}]
[null,"MDF","E","MR","W1200","PM","Perfectsense","Porcelain White",null,"CE",null,null,null,null,null,null,null,null,null,16,null,null,null,null,null,null,null,null,null,null,null,null,null,{"$f":"$I$7&\" \"&$J$9&\" \"&E101&\" \"&G101&\" \"&H101","v":"Melamine 18mm W1200 Perfectsense Porcelain White"}]
[null,"MDF","E","MR","U702","PG","Perfectsense","Cashmere",null,"CE",null,null,null,null,null,null,null,null,null,16,null,null,null,null,null,null,null,null,null,null,null,null,null,"Melamine 18mm U702 Perfectsense Cashmere"]
[null,"MDF","E","MR","U727","PG","Perfectsense","Stone Grey",null,"CE",null,null,null,null,null,null,null,null,null,16,null,null,null,null,null,null,null,null,null,null,null,null,null,"Melamine 18mm U727 Perfectsense Stone Grey"]
[null,"MDF","E","MR","U732","PG","Perfectsense","Dust Grey",null,"CE",null,null,null,null,null,null,null,null,null,16,null,null,null,null,null,null,null,null,null,null,null,null,null,"Melamine 18mm U732 Perfectsense Dust Grey"]
[null,"MDF","E","MR","U763","PG","Perfectsense","Pearl Grey",null,"CE",null,null,null,null,null,null,null,null,null,16,null,null,null,null,null,null,null,null,null,null,null,null,null,"Melamine 18mm U763 Perfectsense Pearl Grey"]
[null,"MDF","E","MR","U775","PG","Perfectsense","White Grey",null,"CE",null,null,null,null,null,null,null,null,null,16,null,null,null,null,null,null,null,null,null,null,null,null,null,"Melamine 18mm U775 Perfectsense White Grey"]
[null,"MDF","E","MR","U960","PG","Perfectsense","Onyx Grey",null,"CE",null,null,null,null,null,null,null,null,null,16,null,null,null,null,null,null,null,null,null,null,null,null,null,"Melamine 18mm U960 Perfectsense Onyx Grey"]
[null,"MDF","E","MR","U961","PG","Perfectsense","Graphite",null,"CE",null,null,null,null,null,null,null,null,null,16,null,null,null,null,null,null,null,null,null,null,null,null,null,"Melamine 18mm U961 Perfectsense Graphite"]
[null,"MDF","E","MR","U999","PG","Perfectsense","Black",null,"CE",null,null,null,null,null,null,null,null,null,16,null,null,null,null,null,null,null,null,null,null,null,null,null,"Melamine 18mm U999 Perfectsense Black"]
[null,"MDF","E","MR","W1000","PG","Perfectsense","Premium White",null,"CE",null,null,null,null,null,null,null,null,null,16,null,null,null,null,null,null,null,null,null,null,null,null,null,"Melamine 18mm W1000 Perfectsense Premium White"]
[null,"MDF","E","MR","W1100","PG","Perfectsense","Alpine White",null,"CE",null,null,null,null,null,null,null,null,null,16,null,null,null,null,null,null,null,null,null,null,null,null,null,"Melamine 18mm W1100 Perfectsense Alpine White"]
[null,"MDF","E","MR","W1200","PG","Perfectsense","Porcelain White",null,"CE",null,null,null,null,null,null,null,null,null,16,null,null,null,null,null,null,null,null,null,null,null,null,null,"Melamine 18mm W1200 Perfectsense Porcelain White"]
[null,"MDF","M","MR",null,"Single Sided","Acrylic","Crisp White",null,"CE",null,null,null,null,null,null,null,null,null,17,null,null,null,null,null,null,null,null,null,null,null,null,null,"Melamine 18mm  Acrylic Crisp White"]
[null,"MDF","M","MR",null,"Single Sided","Acrylic","Pure White",null,"CE",null,null,null,null,null,null,null,null,null,18,null,null,null,null,null,null,null,null,null,null,null,null,null,"Melamine 18mm  Acrylic Pure White"]
[null,"MDF","M","MR",null,"Double Sided","Acrylic","Pure White",null,"CE",null,null,null,null,null,null,null,null,null,19,null,null,null,null,null,null,null,null,null,null,null,null,null,"Melamine 18mm  Acrylic Pure White"]
[null,"MDF","M","MR",5001,"ST","Meraki","Volcanic Black",null,"CE",null,null,null,null,null,null,null,null,null,20,null,null,null,null,null,null,null,null,null,null,null,null,null,"Melamine 18mm 5001 Meraki Volcanic Black"]
[null,"MDF","M","MR",5002,"ST","Meraki","Naval Blue",null,"CE",null,null,null,null,null,null,null,null,null,20,null,null,null,null,null,null,null,null,null,null,null,null,null,"Melamine 18mm 5002 Meraki Naval Blue"]
[null,"MDF","M","MR",5003,"ST","Meraki","Simply White",null,"CE",null,null,null,null,null,null,null,null,null,20,null,null,null,null,null,null,null,null,null,null,null,null,null,"Melamine 18mm 5003 Meraki Simply White"]
[null,"MDF","M","MR",5004,"ST","Meraki","Spring Green",null,"CE",null,null,null,null,null,null,null,null,null,20,null,null,null,null,null,null,null,null,null,null,null,null,null,"Melamine 18mm 5004 Meraki Spring Green"]
[null,"MDF","M","MR",5005,"ST","Meraki","Peppercorn Grey",null,"CE",null,null,null,null,null,null,null,null,null,20,null,null,null,null,null,null,null,null,null,null,null,null,null,"Melamine 18mm 5005 Meraki Peppercorn Grey"]
[null,"MDF","M","MR",5006,"ST","Meraki","Sahara Blonde",null,"CE",null,null,null,null,null,null,null,null,null,20,null,null,null,null,null,null,null,null,null,null,null,null,null,"Melamine 18mm 5006 Meraki Sahara Blonde"]
[null,"MDF","M","MR",5007,"ST","Meraki","Passive Grey",null,"CE",null,null,null,null,null,null,null,null,null,20,null,null,null,null,null,null,null,null,null,null,null,null,null,"Melamine 18mm 5007 Meraki Passive Grey"]
[null,"MDF","M","MR",5008,"ST","Meraki","Dorian Grey",null,"CE",null,null,null,null,null,null,null,null,null,20,null,null,null,null,null,null,null,null,null,null,null,null,null,"Melamine 18mm 5008 Meraki Dorian Grey"]
[null,"MDF","M","MR",5009,"ST","Meraki","Aspen White",null,"CE",null,null,null,null,null,null,null,null,null,20,null,null,null,null,null,null,null,null,null,null,null,null,null,"Melamine 18mm 5009 Meraki Aspen White"]
[null,null,null,null,null,null,null,null,null,null,null,null,null,null,null,null,null,null,null,null,null,null,null,null,null,null,null,null,null,null,null,null,null,"Melamine 18mm   "]

{"sheet":"JH","index":1,"n_rows":47,"n_cols":31,"rows_kept":47,"cut":false,"hidden":false,"merged":[[9,5,9,10],[10,5,10,10],[11,5,11,10],[44,3,44,12],[45,3,45,12],[17,8,17,11],[17,12,18,12],[6,5,6,10],[7,5,7,10],[8,5,8,10],[1,3,1,6],[3,4,3,6],[4,5,4,10],[5,5,5,10],[2,3,2,10],[44,13,45,13],[17,13,18,13],[14,3,14,9],[15,3,15,9],[17,3,18,3],[17,4,18,4],[17,5,18,5],[17,6,18,6],[17,7,18,7]]}
[null,null,null,null,null,null,null,null,null,null,null,null,null,null,null,null,3]
[]
[null,null,null,"J-HANDLE Order Form",null,null,null,null,null,null,null,null,null,null,null,null,{"$f":"VLOOKUP($Q1,'Availability Chart'!$AA$11:$AF$100,COLUMN(B1),FALSE)","v":"J Handle Premium White"},{"$f":"VLOOKUP($Q1,'Availability Chart'!$AA$11:$AF$100,COLUMN(C1),FALSE)","v":"Prices!C35:T48"},{"$f":"VLOOKUP($Q1,'Availability Chart'!$AA$11:$AF$100,COLUMN(D1),FALSE)","v":"Prices!D35:T35"},{"$f":"VLOOKUP($Q1,'Availability Chart'!$AA$11:$AF$100,COLUMN(E1),FALSE)","v":"Prices!C36:C48"},{"$f":"VLOOKUP($Q1,'Availability Chart'!$AA$11:$AF$100,COLUMN(F1),FALSE)","v":34},null,null,null,"All","NoJ",null,"Grain","Plain"]
[]
[null,null,null,"Company Name",null,null,null,null,null,null,null,null,null,null,null,null,null,null,null,null,null,null,null,null,"Y","Y",null,"Horizontal","Plain"]
[null,null,null,"Contact Person",null,null,null,null,null,null,null,null,null,null,null,null,null,null,null,null,null,null,null,null,"N","N",null,"Vertical"]
[null,null,null,"Address",null,null,null,null,null,null,null,null,null,null,null,null,"Colour Group",null,null,null,null,null,null,null,"J"]
[null,null,null,"Customer Order #",null,null,null,null,null,null,null,null,null,null,null,null,"Plain",null,{"$f":"IF(Q8=\"Plain\",\"Plain\",\"Grain\")","v":"Plain"}]
[null,null,null,"Phone #:"]
[null,null,null,"Email:"]
[null,null,null,"Other:"]
[null,null,null,"Date",null,{"$f":"TODAY()","v":"2020-09-01"}]
[null,null,null,"(automatically set to today when sending)"]
[]
[null,null,null,"Colour"]
[null,null,null,"W1000 ST9 MR Premium White"]
[null,null,null,null,null,null,{"$f":"AVERAGE(IF(#REF!<>\"\",COUNTIFS(#REF!,#REF!,#REF!,#REF!)),1)","v":{"$error":"#REF!"}}]
[null,null,null,"Qty","HEIGHT (mm)","WIDTH (mm)","Hinge holes","Orientation","Edge",null,null,null,"$/UNIT","Total Price"]
[null,null,null,null,null,null,null,null,"L","R","T","B",null,null,null,null,null,null,null,null,null,null,null,"L","R","T","B","Max Height","Max Width","Min Height","Min Width"]
[null,null,1,null,null,null,null,{"$f":"IF(D20<>0,\"Plain\",\"\")","v":""},{"$f":"IF($D20<>0,\"Y\",\"\")","v":""},"","","",{"$f":"IFERROR(VLOOKUP(\nINDIRECT(\"Prices!C\"&$U$3+1+MIN(MATCH(E20,(INT(LEFT(INDIRECT($T$3),FIND(\"-\",INDIRECT($T$3),1)-1))),1))),\nINDIRECT($R$3),\n1+MIN(MATCH(F20,(INT(LEFT(INDIRECT($S$3),FIND(\"-\",INDIRECT($S$3),1)-1))),1)),\nFALSE),0)","v":0},{"$f":"+M20*D20","v":0},null,null,null,null,null,null,null,null,null,{"$f":"IF(OR(H20=\"Horizontal\",H20=\"Plain\"),IF(COUNTIF($I20:$L20,\"J\")=0,\"All\",\"NoJ\"),\nIF(H20=\"Vertical\",\"NoJ\"))","v":false},{"$f":"IF(OR(H20=\"Horizontal\",H20=\"Plain\"),IF(COUNTIF($I20:$L20,\"J\")=0,\"All\",\"NoJ\"),\nIF(H20=\"Vertical\",\"NoJ\"))","v":false},{"$f":"IF(OR(H20=\"Vertical\",H20=\"Plain\"),IF(COUNTIF($I20:$L20,\"J\")=0,\"All\",\"NoJ\"),\nIF(H20=\"Horizontal\",\"NoJ\"))","v":false},{"$f":"IF(OR(H20=\"Vertical\",H20=\"Plain\"),IF(COUNTIF($I20:$L20,\"J\")=0,\"All\",\"NoJ\"),\nIF(H20=\"Horizontal\",\"NoJ\"))","v":false},{"$f":"VLOOKUP(JH!$Q$1,'Availability Chart'!$AA$9:$AH$44,IF(H20=\"vertical\",8,7),FALSE)","v":2790},{"$f":"VLOOKUP(JH!$Q$1,'Availability Chart'!$AA$9:$AH$44,IF(H20=\"vertical\",7,8),FALSE)","v":1490},{"$f":"VLOOKUP($Q$1,'Availability Chart'!$AA$9:$AJ$44,IF(H20=\"vertical\",10,9),FALSE)","v":148},{"$f":"VLOOKUP($Q$1,'Availability Chart'!$AA$9:$AJ$44,IF(H20=\"vertical\",9,10),FALSE)","v":148}]
[null,null,2,null,null,null,null,"","","","","",{"$f":"IFERROR(VLOOKUP(\nINDIRECT(\"Prices!C\"&$U$3+1+MIN(MATCH(E21,(INT(LEFT(INDIRECT($T$3),FIND(\"-\",INDIRECT($T$3),1)-1))),1))),\nINDIRECT($R$3),\n1+MIN(MATCH(F21,(INT(LEFT(INDIRECT($S$3),FIND(\"-\",INDIRECT($S$3),1)-1))),1)),\nFALSE),0)","v":0},0,null,null,null,null,null,null,null,null,null,{"$f":"IF(OR(H21=\"Horizontal\",H21=\"Plain\"),IF(COUNTIF($I21:$L21,\"J\")=0,\"All\",\"NoJ\"),\nIF(H21=\"Vertical\",\"NoJ\"))","v":false},{"$f":"IF(OR(H21=\"Horizontal\",H21=\"Plain\"),IF(COUNTIF($I21:$L21,\"J\")=0,\"All\",\"NoJ\"),\nIF(H21=\"Vertical\",\"NoJ\"))","v":false},{"$f":"IF(OR(H21=\"Vertical\",H21=\"Plain\"),IF(COUNTIF($I21:$L21,\"J\")=0,\"All\",\"NoJ\"),\nIF(H21=\"Horizontal\",\"NoJ\"))","v":false},{"$f":"IF(OR(H21=\"Vertical\",H21=\"Plain\"),IF(COUNTIF($I21:$L21,\"J\")=0,\"All\",\"NoJ\"),\nIF(H21=\"Horizontal\",\"NoJ\"))","v":false},{"$f":"VLOOKUP(JH!$Q$1,'Availability Chart'!$AA$9:$AH$44,IF(H21=\"vertical\",8,7),FALSE)","v":2790},{"$f":"VLOOKUP(JH!$Q$1,'Availability Chart'!$AA$9:$AH$44,IF(H21=\"vertical\",7,8),FALSE)","v":1490},{"$f":"VLOOKUP($Q$1,'Availability Chart'!$AA$9:$AJ$44,IF(H21=\"vertical\",10,9),FALSE)","v":148},{"$f":"VLOOKUP($Q$1,'Availability Chart'!$AA$9:$AJ$44,IF(H21=\"vertical\",9,10),FALSE)","v":148}]
[null,null,3,null,null,null,null,"","","","","",{"$f":"IFERROR(VLOOKUP(\nINDIRECT(\"Prices!C\"&$U$3+1+MIN(MATCH(E22,(INT(LEFT(INDIRECT($T$3),FIND(\"-\",INDIRECT($T$3),1)-1))),1))),\nINDIRECT($R$3),\n1+MIN(MATCH(F22,(INT(LEFT(INDIRECT($S$3),FIND(\"-\",INDIRECT($S$3),1)-1))),1)),\nFALSE),0)","v":0},0,null,null,null,null,null,null,null,null,null,false,false,false,false,{"$f":"VLOOKUP(JH!$Q$1,'Availability Chart'!$AA$9:$AH$44,IF(H22=\"vertical\",8,7),FALSE)","v":2790},{"$f":"VLOOKUP(JH!$Q$1,'Availability Chart'!$AA$9:$AH$44,IF(H22=\"vertical\",7,8),FALSE)","v":1490},{"$f":"VLOOKUP($Q$1,'Availability Chart'!$AA$9:$AJ$44,IF(H22=\"vertical\",10,9),FALSE)","v":148},{"$f":"VLOOKUP($Q$1,'Availability Chart'!$AA$9:$AJ$44,IF(H22=\"vertical\",9,10),FALSE)","v":148}]
[null,null,4,null,null,null,null,"","","","","",{"$f":"IFERROR(VLOOKUP(\nINDIRECT(\"Prices!C\"&$U$3+1+MIN(MATCH(E23,(INT(LEFT(INDIRECT($T$3),FIND(\"-\",INDIRECT($T$3),1)-1))),1))),\nINDIRECT($R$3),\n1+MIN(MATCH(F23,(INT(LEFT(INDIRECT($S$3),FIND(\"-\",INDIRECT($S$3),1)-1))),1)),\nFALSE),0)","v":0},0,null,null,null,null,null,null,null,null,null,false,false,false,false,{"$f":"VLOOKUP(JH!$Q$1,'Availability Chart'!$AA$9:$AH$44,IF(H23=\"vertical\",8,7),FALSE)","v":2790},{"$f":"VLOOKUP(JH!$Q$1,'Availability Chart'!$AA$9:$AH$44,IF(H23=\"vertical\",7,8),FALSE)","v":1490},{"$f":"VLOOKUP($Q$1,'Availability Chart'!$AA$9:$AJ$44,IF(H23=\"vertical\",10,9),FALSE)","v":148},{"$f":"VLOOKUP($Q$1,'Availability Chart'!$AA$9:$AJ$44,IF(H23=\"vertical\",9,10),FALSE)","v":148}]
[null,null,5,null,null,null,null,"","","","","",{"$f":"IFERROR(VLOOKUP(\nINDIRECT(\"Prices!C\"&$U$3+1+MIN(MATCH(E24,(INT(LEFT(INDIRECT($T$3),FIND(\"-\",INDIRECT($T$3),1)-1))),1))),\nINDIRECT($R$3),\n1+MIN(MATCH(F24,(INT(LEFT(INDIRECT($S$3),FIND(\"-\",INDIRECT($S$3),1)-1))),1)),\nFALSE),0)","v":0},0,null,null,null,null,null,null,null,null,null,false,false,false,false,{"$f":"VLOOKUP(JH!$Q$1,'Availability Chart'!$AA$9:$AH$44,IF(H24=\"vertical\",8,7),FALSE)","v":2790},{"$f":"VLOOKUP(JH!$Q$1,'Availability Chart'!$AA$9:$AH$44,IF(H24=\"vertical\",7,8),FALSE)","v":1490},{"$f":"VLOOKUP($Q$1,'Availability Chart'!$AA$9:$AJ$44,IF(H24=\"vertical\",10,9),FALSE)","v":148},{"$f":"VLOOKUP($Q$1,'Availability Chart'!$AA$9:$AJ$44,IF(H24=\"vertical\",9,10),FALSE)","v":148}]
[null,null,6,null,null,null,null,"","","","","",{"$f":"IFERROR(VLOOKUP(\nINDIRECT(\"Prices!C\"&$U$3+1+MIN(MATCH(E25,(INT(LEFT(INDIRECT($T$3),FIND(\"-\",INDIRECT($T$3),1)-1))),1))),\nINDIRECT($R$3),\n1+MIN(MATCH(F25,(INT(LEFT(INDIRECT($S$3),FIND(\"-\",INDIRECT($S$3),1)-1))),1)),\nFALSE),0)","v":0},0,null,null,null,null,null,null,null,null,null,false,false,false,false,{"$f":"VLOOKUP(JH!$Q$1,'Availability Chart'!$AA$9:$AH$44,IF(H25=\"vertical\",8,7),FALSE)","v":2790},{"$f":"VLOOKUP(JH!$Q$1,'Availability Chart'!$AA$9:$AH$44,IF(H25=\"vertical\",7,8),FALSE)","v":1490},{"$f":"VLOOKUP($Q$1,'Availability Chart'!$AA$9:$AJ$44,IF(H25=\"vertical\",10,9),FALSE)","v":148},{"$f":"VLOOKUP($Q$1,'Availability Chart'!$AA$9:$AJ$44,IF(H25=\"vertical\",9,10),FALSE)","v":148}]
[null,null,7,null,null,null,null,"","","","","",{"$f":"IFERROR(VLOOKUP(\nINDIRECT(\"Prices!C\"&$U$3+1+MIN(MATCH(E26,(INT(LEFT(INDIRECT($T$3),FIND(\"-\",INDIRECT($T$3),1)-1))),1))),\nINDIRECT($R$3),\n1+MIN(MATCH(F26,(INT(LEFT(INDIRECT($S$3),FIND(\"-\",INDIRECT($S$3),1)-1))),1)),\nFALSE),0)","v":0},0,null,null,null,null,null,null,null,null,null,false,false,false,false,{"$f":"VLOOKUP(JH!$Q$1,'Availability Chart'!$AA$9:$AH$44,IF(H26=\"vertical\",8,7),FALSE)","v":2790},{"$f":"VLOOKUP(JH!$Q$1,'Availability Chart'!$AA$9:$AH$44,IF(H26=\"vertical\",7,8),FALSE)","v":1490},{"$f":"VLOOKUP($Q$1,'Availability Chart'!$AA$9:$AJ$44,IF(H26=\"vertical\",10,9),FALSE)","v":148},{"$f":"VLOOKUP($Q$1,'Availability Chart'!$AA$9:$AJ$44,IF(H26=\"vertical\",9,10),FALSE)","v":148}]
[null,null,8,null,null,null,null,"","","","","",{"$f":"IFERROR(VLOOKUP(\nINDIRECT(\"Prices!C\"&$U$3+1+MIN(MATCH(E27,(INT(LEFT(INDIRECT($T$3),FIND(\"-\",INDIRECT($T$3),1)-1))),1))),\nINDIRECT($R$3),\n1+MIN(MATCH(F27,(INT(LEFT(INDIRECT($S$3),FIND(\"-\",INDIRECT($S$3),1)-1))),1)),\nFALSE),0)","v":0},0,null,null,null,null,null,null,null,null,null,false,false,false,false,{"$f":"VLOOKUP(JH!$Q$1,'Availability Chart'!$AA$9:$AH$44,IF(H27=\"vertical\",8,7),FALSE)","v":2790},{"$f":"VLOOKUP(JH!$Q$1,'Availability Chart'!$AA$9:$AH$44,IF(H27=\"vertical\",7,8),FALSE)","v":1490},{"$f":"VLOOKUP($Q$1,'Availability Chart'!$AA$9:$AJ$44,IF(H27=\"vertical\",10,9),FALSE)","v":148},{"$f":"VLOOKUP($Q$1,'Availability Chart'!$AA$9:$AJ$44,IF(H27=\"vertical\",9,10),FALSE)","v":148}]
[null,null,9,null,null,null,null,"","","","","",{"$f":"IFERROR(VLOOKUP(\nINDIRECT(\"Prices!C\"&$U$3+1+MIN(MATCH(E28,(INT(LEFT(INDIRECT($T$3),FIND(\"-\",INDIRECT($T$3),1)-1))),1))),\nINDIRECT($R$3),\n1+MIN(MATCH(F28,(INT(LEFT(INDIRECT($S$3),FIND(\"-\",INDIRECT($S$3),1)-1))),1)),\nFALSE),0)","v":0},0,null,null,null,null,null,null,null,null,null,false,false,false,false,{"$f":"VLOOKUP(JH!$Q$1,'Availability Chart'!$AA$9:$AH$44,IF(H28=\"vertical\",8,7),FALSE)","v":2790},{"$f":"VLOOKUP(JH!$Q$1,'Availability Chart'!$AA$9:$AH$44,IF(H28=\"vertical\",7,8),FALSE)","v":1490},{"$f":"VLOOKUP($Q$1,'Availability Chart'!$AA$9:$AJ$44,IF(H28=\"vertical\",10,9),FALSE)","v":148},{"$f":"VLOOKUP($Q$1,'Availability Chart'!$AA$9:$AJ$44,IF(H28=\"vertical\",9,10),FALSE)","v":148}]
[null,null,10,null,null,null,null,"","","","","",{"$f":"IFERROR(VLOOKUP(\nINDIRECT(\"Prices!C\"&$U$3+1+MIN(MATCH(E29,(INT(LEFT(INDIRECT($T$3),FIND(\"-\",INDIRECT($T$3),1)-1))),1))),\nINDIRECT($R$3),\n1+MIN(MATCH(F29,(INT(LEFT(INDIRECT($S$3),FIND(\"-\",INDIRECT($S$3),1)-1))),1)),\nFALSE),0)","v":0},0,null,null,null,null,null,null,null,null,null,false,false,false,false,{"$f":"VLOOKUP(JH!$Q$1,'Availability Chart'!$AA$9:$AH$44,IF(H29=\"vertical\",8,7),FALSE)","v":2790},{"$f":"VLOOKUP(JH!$Q$1,'Availability Chart'!$AA$9:$AH$44,IF(H29=\"vertical\",7,8),FALSE)","v":1490},{"$f":"VLOOKUP($Q$1,'Availability Chart'!$AA$9:$AJ$44,IF(H29=\"vertical\",10,9),FALSE)","v":148},{"$f":"VLOOKUP($Q$1,'Availability Chart'!$AA$9:$AJ$44,IF(H29=\"vertical\",9,10),FALSE)","v":148}]
[null,null,11,null,null,null,null,"","","","","",{"$f":"IFERROR(VLOOKUP(\nINDIRECT(\"Prices!C\"&$U$3+1+MIN(MATCH(E30,(INT(LEFT(INDIRECT($T$3),FIND(\"-\",INDIRECT($T$3),1)-1))),1))),\nINDIRECT($R$3),\n1+MIN(MATCH(F30,(INT(LEFT(INDIRECT($S$3),FIND(\"-\",INDIRECT($S$3),1)-1))),1)),\nFALSE),0)","v":0},0,null,null,null,null,null,null,null,null,null,false,false,false,false,{"$f":"VLOOKUP(JH!$Q$1,'Availability Chart'!$AA$9:$AH$44,IF(H30=\"vertical\",8,7),FALSE)","v":2790},{"$f":"VLOOKUP(JH!$Q$1,'Availability Chart'!$AA$9:$AH$44,IF(H30=\"vertical\",7,8),FALSE)","v":1490},{"$f":"VLOOKUP($Q$1,'Availability Chart'!$AA$9:$AJ$44,IF(H30=\"vertical\",10,9),FALSE)","v":148},{"$f":"VLOOKUP($Q$1,'Availability Chart'!$AA$9:$AJ$44,IF(H30=\"vertical\",9,10),FALSE)","v":148}]
[null,null,12,null,null,null,null,"","","","","",{"$f":"IFERROR(VLOOKUP(\nINDIRECT(\"Prices!C\"&$U$3+1+MIN(MATCH(E31,(INT(LEFT(INDIRECT($T$3),FIND(\"-\",INDIRECT($T$3),1)-1))),1))),\nINDIRECT($R$3),\n1+MIN(MATCH(F31,(INT(LEFT(INDIRECT($S$3),FIND(\"-\",INDIRECT($S$3),1)-1))),1)),\nFALSE),0)","v":0},0,null,null,null,null,null,null,null,null,null,false,false,false,false,{"$f":"VLOOKUP(JH!$Q$1,'Availability Chart'!$AA$9:$AH$44,IF(H31=\"vertical\",8,7),FALSE)","v":2790},{"$f":"VLOOKUP(JH!$Q$1,'Availability Chart'!$AA$9:$AH$44,IF(H31=\"vertical\",7,8),FALSE)","v":1490},{"$f":"VLOOKUP($Q$1,'Availability Chart'!$AA$9:$AJ$44,IF(H31=\"vertical\",10,9),FALSE)","v":148},{"$f":"VLOOKUP($Q$1,'Availability Chart'!$AA$9:$AJ$44,IF(H31=\"vertical\",9,10),FALSE)","v":148}]
[null,null,13,null,null,null,null,"","","","","",{"$f":"IFERROR(VLOOKUP(\nINDIRECT(\"Prices!C\"&$U$3+1+MIN(MATCH(E32,(INT(LEFT(INDIRECT($T$3),FIND(\"-\",INDIRECT($T$3),1)-1))),1))),\nINDIRECT($R$3),\n1+MIN(MATCH(F32,(INT(LEFT(INDIRECT($S$3),FIND(\"-\",INDIRECT($S$3),1)-1))),1)),\nFALSE),0)","v":0},0,null,null,null,null,null,null,null,null,null,false,false,false,false,{"$f":"VLOOKUP(JH!$Q$1,'Availability Chart'!$AA$9:$AH$44,IF(H32=\"vertical\",8,7),FALSE)","v":2790},{"$f":"VLOOKUP(JH!$Q$1,'Availability Chart'!$AA$9:$AH$44,IF(H32=\"vertical\",7,8),FALSE)","v":1490},{"$f":"VLOOKUP($Q$1,'Availability Chart'!$AA$9:$AJ$44,IF(H32=\"vertical\",10,9),FALSE)","v":148},{"$f":"VLOOKUP($Q$1,'Availability Chart'!$AA$9:$AJ$44,IF(H32=\"vertical\",9,10),FALSE)","v":148}]
[null,null,14,null,null,null,null,"","","","","",{"$f":"IFERROR(VLOOKUP(\nINDIRECT(\"Prices!C\"&$U$3+1+MIN(MATCH(E33,(INT(LEFT(INDIRECT($T$3),FIND(\"-\",INDIRECT($T$3),1)-1))),1))),\nINDIRECT($R$3),\n1+MIN(MATCH(F33,(INT(LEFT(INDIRECT($S$3),FIND(\"-\",INDIRECT($S$3),1)-1))),1)),\nFALSE),0)","v":0},0,null,null,null,null,null,null,null,null,null,false,false,false,false,{"$f":"VLOOKUP(JH!$Q$1,'Availability Chart'!$AA$9:$AH$44,IF(H33=\"vertical\",8,7),FALSE)","v":2790},{"$f":"VLOOKUP(JH!$Q$1,'Availability Chart'!$AA$9:$AH$44,IF(H33=\"vertical\",7,8),FALSE)","v":1490},{"$f":"VLOOKUP($Q$1,'Availability Chart'!$AA$9:$AJ$44,IF(H33=\"vertical\",10,9),FALSE)","v":148},{"$f":"VLOOKUP($Q$1,'Availability Chart'!$AA$9:$AJ$44,IF(H33=\"vertical\",9,10),FALSE)","v":148}]
[null,null,15,null,null,null,null,"","","","","",{"$f":"IFERROR(VLOOKUP(\nINDIRECT(\"Prices!C\"&$U$3+1+MIN(MATCH(E34,(INT(LEFT(INDIRECT($T$3),FIND(\"-\",INDIRECT($T$3),1)-1))),1))),\nINDIRECT($R$3),\n1+MIN(MATCH(F34,(INT(LEFT(INDIRECT($S$3),FIND(\"-\",INDIRECT($S$3),1)-1))),1)),\nFALSE),0)","v":0},0,null,null,null,null,null,null,null,null,null,false,false,false,false,{"$f":"VLOOKUP(JH!$Q$1,'Availability Chart'!$AA$9:$AH$44,IF(H34=\"vertical\",8,7),FALSE)","v":2790},{"$f":"VLOOKUP(JH!$Q$1,'Availability Chart'!$AA$9:$AH$44,IF(H34=\"vertical\",7,8),FALSE)","v":1490},{"$f":"VLOOKUP($Q$1,'Availability Chart'!$AA$9:$AJ$44,IF(H34=\"vertical\",10,9),FALSE)","v":148},{"$f":"VLOOKUP($Q$1,'Availability Chart'!$AA$9:$AJ$44,IF(H34=\"vertical\",9,10),FALSE)","v":148}]
[null,null,16,null,null,null,null,"","","","","",{"$f":"IFERROR(VLOOKUP(\nINDIRECT(\"Prices!C\"&$U$3+1+MIN(MATCH(E35,(INT(LEFT(INDIRECT($T$3),FIND(\"-\",INDIRECT($T$3),1)-1))),1))),\nINDIRECT($R$3),\n1+MIN(MATCH(F35,(INT(LEFT(INDIRECT($S$3),FIND(\"-\",INDIRECT($S$3),1)-1))),1)),\nFALSE),0)","v":0},0,null,null,null,null,null,null,null,null,null,false,false,false,false,{"$f":"VLOOKUP(JH!$Q$1,'Availability Chart'!$AA$9:$AH$44,IF(H35=\"vertical\",8,7),FALSE)","v":2790},{"$f":"VLOOKUP(JH!$Q$1,'Availability Chart'!$AA$9:$AH$44,IF(H35=\"vertical\",7,8),FALSE)","v":1490},{"$f":"VLOOKUP($Q$1,'Availability Chart'!$AA$9:$AJ$44,IF(H35=\"vertical\",10,9),FALSE)","v":148},{"$f":"VLOOKUP($Q$1,'Availability Chart'!$AA$9:$AJ$44,IF(H35=\"vertical\",9,10),FALSE)","v":148}]
[null,null,17,null,null,null,null,"","","","","",{"$f":"IFERROR(VLOOKUP(\nINDIRECT(\"Prices!C\"&$U$3+1+MIN(MATCH(E36,(INT(LEFT(INDIRECT($T$3),FIND(\"-\",INDIRECT($T$3),1)-1))),1))),\nINDIRECT($R$3),\n1+MIN(MATCH(F36,(INT(LEFT(INDIRECT($S$3),FIND(\"-\",INDIRECT($S$3),1)-1))),1)),\nFALSE),0)","v":0},0,null,null,null,null,null,null,null,null,null,false,false,false,false,{"$f":"VLOOKUP(JH!$Q$1,'Availability Chart'!$AA$9:$AH$44,IF(H36=\"vertical\",8,7),FALSE)","v":2790},{"$f":"VLOOKUP(JH!$Q$1,'Availability Chart'!$AA$9:$AH$44,IF(H36=\"vertical\",7,8),FALSE)","v":1490},{"$f":"VLOOKUP($Q$1,'Availability Chart'!$AA$9:$AJ$44,IF(H36=\"vertical\",10,9),FALSE)","v":148},{"$f":"VLOOKUP($Q$1,'Availability Chart'!$AA$9:$AJ$44,IF(H36=\"vertical\",9,10),FALSE)","v":148}]
[null,null,18,null,null,null,null,"","","","","",{"$f":"IFERROR(VLOOKUP(\nINDIRECT(\"Prices!C\"&$U$3+1+MIN(MATCH(E37,(INT(LEFT(INDIRECT($T$3),FIND(\"-\",INDIRECT($T$3),1)-1))),1))),\nINDIRECT($R$3),\n1+MIN(MATCH(F37,(INT(LEFT(INDIRECT($S$3),FIND(\"-\",INDIRECT($S$3),1)-1))),1)),\nFALSE),0)","v":0},0,null,null,null,null,null,null,null,null,null,false,false,false,false,{"$f":"VLOOKUP(JH!$Q$1,'Availability Chart'!$AA$9:$AH$44,IF(H37=\"vertical\",8,7),FALSE)","v":2790},{"$f":"VLOOKUP(JH!$Q$1,'Availability Chart'!$AA$9:$AH$44,IF(H37=\"vertical\",7,8),FALSE)","v":1490},{"$f":"VLOOKUP($Q$1,'Availability Chart'!$AA$9:$AJ$44,IF(H37=\"vertical\",10,9),FALSE)","v":148},{"$f":"VLOOKUP($Q$1,'Availability Chart'!$AA$9:$AJ$44,IF(H37=\"vertical\",9,10),FALSE)","v":148}]
[null,null,19,null,null,null,null,"","","","","",{"$f":"IFERROR(VLOOKUP(\nINDIRECT(\"Prices!C\"&$U$3+1+MIN(MATCH(E38,(INT(LEFT(INDIRECT($T$3),FIND(\"-\",INDIRECT($T$3),1)-1))),1))),\nINDIRECT($R$3),\n1+MIN(MATCH(F38,(INT(LEFT(INDIRECT($S$3),FIND(\"-\",INDIRECT($S$3),1)-1))),1)),\nFALSE),0)","v":0},0,null,null,null,null,null,null,null,null,null,false,false,false,false,{"$f":"VLOOKUP(JH!$Q$1,'Availability Chart'!$AA$9:$AH$44,IF(H38=\"vertical\",8,7),FALSE)","v":2790},{"$f":"VLOOKUP(JH!$Q$1,'Availability Chart'!$AA$9:$AH$44,IF(H38=\"vertical\",7,8),FALSE)","v":1490},{"$f":"VLOOKUP($Q$1,'Availability Chart'!$AA$9:$AJ$44,IF(H38=\"vertical\",10,9),FALSE)","v":148},{"$f":"VLOOKUP($Q$1,'Availability Chart'!$AA$9:$AJ$44,IF(H38=\"vertical\",9,10),FALSE)","v":148}]
[null,null,20,null,null,null,null,"","","","","",{"$f":"IFERROR(VLOOKUP(\nINDIRECT(\"Prices!C\"&$U$3+1+MIN(MATCH(E39,(INT(LEFT(INDIRECT($T$3),FIND(\"-\",INDIRECT($T$3),1)-1))),1))),\nINDIRECT($R$3),\n1+MIN(MATCH(F39,(INT(LEFT(INDIRECT($S$3),FIND(\"-\",INDIRECT($S$3),1)-1))),1)),\nFALSE),0)","v":0},0,null,null,null,null,null,null,null,null,null,false,false,false,false,{"$f":"VLOOKUP(JH!$Q$1,'Availability Chart'!$AA$9:$AH$44,IF(H39=\"vertical\",8,7),FALSE)","v":2790},{"$f":"VLOOKUP(JH!$Q$1,'Availability Chart'!$AA$9:$AH$44,IF(H39=\"vertical\",7,8),FALSE)","v":1490},{"$f":"VLOOKUP($Q$1,'Availability Chart'!$AA$9:$AJ$44,IF(H39=\"vertical\",10,9),FALSE)","v":148},{"$f":"VLOOKUP($Q$1,'Availability Chart'!$AA$9:$AJ$44,IF(H39=\"vertical\",9,10),FALSE)","v":148}]
[null,null,null,null,null,"Sum of hinge holes",{"$f":"SUM(G20:G39)","v":0},null,null,null,null,null,1,{"$f":"G40","v":0}]
[null,null,null,null,null,null,null,null,null,null,null,null,"Subtotal",{"$f":"+SUM(N20:N40)","v":0}]
[null,null,null,"Please attach a drawing for grain match or hinge positions, if required.",null,null,null,null,null,null,null,null,"GST",{"$f":"+N41*0.1","v":0}]
[null,null,null,null,null,null,null,null,null,null,null,null,"Total",{"$f":"+N42+N41","v":0}]
[]
[null,false,null,"I agree that upon submission strictly no changes can be made to the order, if",null,null,null,null,null,null,null,null,null,"TERMS & CONDITIONS"]
[null,null,null,"changes are made full charges may be incurred."]
[null,null,null,null,null,null,null,null,null,null,null,null,null,"V1"]

{"sheet":"CE","index":2,"n_rows":47,"n_cols":31,"rows_kept":47,"cut":false,"hidden":false,"merged":[[1,3,1,5],[4,3,4,4],[5,3,5,4],[2,3,2,11],[6,3,6,4],[44,13,45,13],[44,3,44,12],[45,3,45,12],[17,8,17,11],[17,12,18,12],[17,13,18,13],[17,6,18,6],[17,5,18,5],[17,4,18,4],[17,3,18,3],[17,7,18,7],[7,3,7,4],[8,3,8,4],[4,5,4,10],[5,5,5,10],[6,5,6,10],[7,5,7,10],[8,5,8,10],[15,8,15,11],[9,3,9,4],[10,3,10,4],[11,3,11,4],[12,3,12,11],[14,3,14,7],[15,3,15,7],[14,8,14,11],[11,5,11,10],[9,5,9,10],[10,5,10,10]]}
[null,null,null,null,null,null,null,null,null,null,null,null,null,null,null,null,16]
[]
[null,null,null,"Cut & Edge Order Form",null,null,null,null,null,null,null,null,null,null,null,null,{"$f":"VLOOKUP($Q1,'Availability Chart'!$AA$11:$AF$100,COLUMN(B1),FALSE)","v":"PerfectSense Matt & Gloss 18mm"},{"$f":"VLOOKUP($Q1,'Availability Chart'!$AA$11:$AF$100,COLUMN(C1),FALSE)","v":"Prices!C233:N244"},{"$f":"VLOOKUP($Q1,'Availability Chart'!$AA$11:$AF$100,COLUMN(D1),FALSE)","v":"Prices!D233:N233"},{"$f":"VLOOKUP($Q1,'Availability Chart'!$AA$11:$AF$100,COLUMN(E1),FALSE)","v":"Prices!C234:C244"},{"$f":"VLOOKUP($Q1,'Availability Chart'!$AA$11:$AF$100,COLUMN(F1),FALSE)","v":232}]
[]
[null,null,null,"Company Name"]
[null,null,null,"Contact Person"]
[null,null,null,"Address"]
[null,null,null,"Customer Order #"]
[null,null,null,"Phone #:"]
[null,null,null,"Email:"]
[null,null,null,"Other:"]
[null,null,null,"Date",null,{"$f":"TODAY()","v":"2020-09-01"}]
[null,null,null,"(automatically set to today when sending)"]
[]
[null,null,null,"Colour",null,null,null,null,"Thickness"]
[null,null,null,"U999 PG MR Black",null,null,null,null,"18mm"]
[]
[null,null,null,"Qty","HEIGHT (mm)","WIDTH (mm)","Hinge holes","Orientation","Edge",null,null,null,"$/UNIT","Total Price"]
[null,null,null,null,null,null,null,null,"L","R","T","B",null,null,null,null,null,null,null,null,null,null,null,null,null,null,null,"Max Height","Max Width","Min Height","Min Width"]
[null,null,1,null,null,null,null,null,{"$f":"IF($D20<>0,\"Y\",\"\")","v":""},"","","",{"$f":"IFERROR(VLOOKUP(\nINDIRECT(\"Prices!C\"&$U$3+1+MIN(MATCH(E20,(INT(LEFT(INDIRECT($T$3),FIND(\"-\",INDIRECT($T$3),1)-1))),1))),\nINDIRECT($R$3),\n1+MIN(MATCH(F20,(INT(LEFT(INDIRECT($S$3),FIND(\"-\",INDIRECT($S$3),1)-1))),1)),\nFALSE),\"\")","v":""},{"$f":"IFERROR(M20*D20,\"\")","v":""},null,null,null,null,null,null,null,null,null,null,null,null,null,{"$f":"VLOOKUP($Q$1,'Availability Chart'!$AA$9:$AH$44,IF(H20=\"vertical\",8,7),FALSE)","v":2780},{"$f":"VLOOKUP($Q$1,'Availability Chart'!$AA$9:$AH$44,IF(H20=\"vertical\",7,8),FALSE)","v":2000},{"$f":"VLOOKUP($Q$1,'Availability Chart'!$AA$9:$AJ$44,IF(H20=\"vertical\",10,9),FALSE)","v":80},{"$f":"VLOOKUP($Q$1,'Availability Chart'!$AA$9:$AJ$44,IF(H20=\"vertical\",9,10),FALSE)","v":80}]
[null,null,2,null,null,null,null,null,"","","","",{"$f":"IFERROR(VLOOKUP(\nINDIRECT(\"Prices!C\"&$U$3+1+MIN(MATCH(E21,(INT(LEFT(INDIRECT($T$3),FIND(\"-\",INDIRECT($T$3),1)-1))),1))),\nINDIRECT($R$3),\n1+MIN(MATCH(F21,(INT(LEFT(INDIRECT($S$3),FIND(\"-\",INDIRECT($S$3),1)-1))),1)),\nFALSE),\"\")","v":""},{"$f":"IFERROR(M21*D21,\"\")","v":""},null,null,null,null,null,null,null,null,null,null,null,null,null,{"$f":"VLOOKUP($Q$1,'Availability Chart'!$AA$9:$AH$44,IF(H21=\"vertical\",8,7),FALSE)","v":2780},{"$f":"VLOOKUP($Q$1,'Availability Chart'!$AA$9:$AH$44,IF(H21=\"vertical\",7,8),FALSE)","v":2000},{"$f":"VLOOKUP($Q$1,'Availability Chart'!$AA$9:$AJ$44,IF(H21=\"vertical\",10,9),FALSE)","v":80},{"$f":"VLOOKUP($Q$1,'Availability Chart'!$AA$9:$AJ$44,IF(H21=\"vertical\",9,10),FALSE)","v":80}]
[null,null,3,null,null,null,null,null,"","","","",{"$f":"IFERROR(VLOOKUP(\nINDIRECT(\"Prices!C\"&$U$3+1+MIN(MATCH(E22,(INT(LEFT(INDIRECT($T$3),FIND(\"-\",INDIRECT($T$3),1)-1))),1))),\nINDIRECT($R$3),\n1+MIN(MATCH(F22,(INT(LEFT(INDIRECT($S$3),FIND(\"-\",INDIRECT($S$3),1)-1))),1)),\nFALSE),\"\")","v":""},"",null,null,null,null,null,null,null,null,null,null,null,null,null,{"$f":"VLOOKUP($Q$1,'Availability Chart'!$AA$9:$AH$44,IF(H22=\"vertical\",8,7),FALSE)","v":2780},{"$f":"VLOOKUP($Q$1,'Availability Chart'!$AA$9:$AH$44,IF(H22=\"vertical\",7,8),FALSE)","v":2000},{"$f":"VLOOKUP($Q$1,'Availability Chart'!$AA$9:$AJ$44,IF(H22=\"vertical\",10,9),FALSE)","v":80},{"$f":"VLOOKUP($Q$1,'Availability Chart'!$AA$9:$AJ$44,IF(H22=\"vertical\",9,10),FALSE)","v":80}]
[null,null,4,null,null,null,null,null,"","","","",{"$f":"IFERROR(VLOOKUP(\nINDIRECT(\"Prices!C\"&$U$3+1+MIN(MATCH(E23,(INT(LEFT(INDIRECT($T$3),FIND(\"-\",INDIRECT($T$3),1)-1))),1))),\nINDIRECT($R$3),\n1+MIN(MATCH(F23,(INT(LEFT(INDIRECT($S$3),FIND(\"-\",INDIRECT($S$3),1)-1))),1)),\nFALSE),\"\")","v":""},"",null,null,null,null,null,null,null,null,null,null,null,null,null,{"$f":"VLOOKUP($Q$1,'Availability Chart'!$AA$9:$AH$44,IF(H23=\"vertical\",8,7),FALSE)","v":2780},{"$f":"VLOOKUP($Q$1,'Availability Chart'!$AA$9:$AH$44,IF(H23=\"vertical\",7,8),FALSE)","v":2000},{"$f":"VLOOKUP($Q$1,'Availability Chart'!$AA$9:$AJ$44,IF(H23=\"vertical\",10,9),FALSE)","v":80},{"$f":"VLOOKUP($Q$1,'Availability Chart'!$AA$9:$AJ$44,IF(H23=\"vertical\",9,10),FALSE)","v":80}]
[null,null,5,null,null,null,null,null,"","","","",{"$f":"IFERROR(VLOOKUP(\nINDIRECT(\"Prices!C\"&$U$3+1+MIN(MATCH(E24,(INT(LEFT(INDIRECT($T$3),FIND(\"-\",INDIRECT($T$3),1)-1))),1))),\nINDIRECT($R$3),\n1+MIN(MATCH(F24,(INT(LEFT(INDIRECT($S$3),FIND(\"-\",INDIRECT($S$3),1)-1))),1)),\nFALSE),\"\")","v":""},"",null,null,null,null,null,null,null,null,null,null,null,null,null,{"$f":"VLOOKUP($Q$1,'Availability Chart'!$AA$9:$AH$44,IF(H24=\"vertical\",8,7),FALSE)","v":2780},{"$f":"VLOOKUP($Q$1,'Availability Chart'!$AA$9:$AH$44,IF(H24=\"vertical\",7,8),FALSE)","v":2000},{"$f":"VLOOKUP($Q$1,'Availability Chart'!$AA$9:$AJ$44,IF(H24=\"vertical\",10,9),FALSE)","v":80},{"$f":"VLOOKUP($Q$1,'Availability Chart'!$AA$9:$AJ$44,IF(H24=\"vertical\",9,10),FALSE)","v":80}]
[null,null,6,null,null,null,null,null,"","","","",{"$f":"IFERROR(VLOOKUP(\nINDIRECT(\"Prices!C\"&$U$3+1+MIN(MATCH(E25,(INT(LEFT(INDIRECT($T$3),FIND(\"-\",INDIRECT($T$3),1)-1))),1))),\nINDIRECT($R$3),\n1+MIN(MATCH(F25,(INT(LEFT(INDIRECT($S$3),FIND(\"-\",INDIRECT($S$3),1)-1))),1)),\nFALSE),\"\")","v":""},"",null,null,null,null,null,null,null,null,null,null,null,null,null,{"$f":"VLOOKUP($Q$1,'Availability Chart'!$AA$9:$AH$44,IF(H25=\"vertical\",8,7),FALSE)","v":2780},{"$f":"VLOOKUP($Q$1,'Availability Chart'!$AA$9:$AH$44,IF(H25=\"vertical\",7,8),FALSE)","v":2000},{"$f":"VLOOKUP($Q$1,'Availability Chart'!$AA$9:$AJ$44,IF(H25=\"vertical\",10,9),FALSE)","v":80},{"$f":"VLOOKUP($Q$1,'Availability Chart'!$AA$9:$AJ$44,IF(H25=\"vertical\",9,10),FALSE)","v":80}]
[null,null,7,null,null,null,null,null,"","","","",{"$f":"IFERROR(VLOOKUP(\nINDIRECT(\"Prices!C\"&$U$3+1+MIN(MATCH(E26,(INT(LEFT(INDIRECT($T$3),FIND(\"-\",INDIRECT($T$3),1)-1))),1))),\nINDIRECT($R$3),\n1+MIN(MATCH(F26,(INT(LEFT(INDIRECT($S$3),FIND(\"-\",INDIRECT($S$3),1)-1))),1)),\nFALSE),\"\")","v":""},"",null,null,null,null,null,null,null,null,null,null,null,null,null,{"$f":"VLOOKUP($Q$1,'Availability Chart'!$AA$9:$AH$44,IF(H26=\"vertical\",8,7),FALSE)","v":2780},{"$f":"VLOOKUP($Q$1,'Availability Chart'!$AA$9:$AH$44,IF(H26=\"vertical\",7,8),FALSE)","v":2000},{"$f":"VLOOKUP($Q$1,'Availability Chart'!$AA$9:$AJ$44,IF(H26=\"vertical\",10,9),FALSE)","v":80},{"$f":"VLOOKUP($Q$1,'Availability Chart'!$AA$9:$AJ$44,IF(H26=\"vertical\",9,10),FALSE)","v":80}]
[null,null,8,null,null,null,null,null,"","","","",{"$f":"IFERROR(VLOOKUP(\nINDIRECT(\"Prices!C\"&$U$3+1+MIN(MATCH(E27,(INT(LEFT(INDIRECT($T$3),FIND(\"-\",INDIRECT($T$3),1)-1))),1))),\nINDIRECT($R$3),\n1+MIN(MATCH(F27,(INT(LEFT(INDIRECT($S$3),FIND(\"-\",INDIRECT($S$3),1)-1))),1)),\nFALSE),\"\")","v":""},"",null,null,null,null,null,null,null,null,null,null,null,null,null,{"$f":"VLOOKUP($Q$1,'Availability Chart'!$AA$9:$AH$44,IF(H27=\"vertical\",8,7),FALSE)","v":2780},{"$f":"VLOOKUP($Q$1,'Availability Chart'!$AA$9:$AH$44,IF(H27=\"vertical\",7,8),FALSE)","v":2000},{"$f":"VLOOKUP($Q$1,'Availability Chart'!$AA$9:$AJ$44,IF(H27=\"vertical\",10,9),FALSE)","v":80},{"$f":"VLOOKUP($Q$1,'Availability Chart'!$AA$9:$AJ$44,IF(H27=\"vertical\",9,10),FALSE)","v":80}]
[null,null,9,null,null,null,null,null,"","","","",{"$f":"IFERROR(VLOOKUP(\nINDIRECT(\"Prices!C\"&$U$3+1+MIN(MATCH(E28,(INT(LEFT(INDIRECT($T$3),FIND(\"-\",INDIRECT($T$3),1)-1))),1))),\nINDIRECT($R$3),\n1+MIN(MATCH(F28,(INT(LEFT(INDIRECT($S$3),FIND(\"-\",INDIRECT($S$3),1)-1))),1)),\nFALSE),\"\")","v":""},"",null,null,null,null,null,null,null,null,null,null,null,null,null,{"$f":"VLOOKUP($Q$1,'Availability Chart'!$AA$9:$AH$44,IF(H28=\"vertical\",8,7),FALSE)","v":2780},{"$f":"VLOOKUP($Q$1,'Availability Chart'!$AA$9:$AH$44,IF(H28=\"vertical\",7,8),FALSE)","v":2000},{"$f":"VLOOKUP($Q$1,'Availability Chart'!$AA$9:$AJ$44,IF(H28=\"vertical\",10,9),FALSE)","v":80},{"$f":"VLOOKUP($Q$1,'Availability Chart'!$AA$9:$AJ$44,IF(H28=\"vertical\",9,10),FALSE)","v":80}]
[null,null,10,null,null,null,null,null,"","","","",{"$f":"IFERROR(VLOOKUP(\nINDIRECT(\"Prices!C\"&$U$3+1+MIN(MATCH(E29,(INT(LEFT(INDIRECT($T$3),FIND(\"-\",INDIRECT($T$3),1)-1))),1))),\nINDIRECT($R$3),\n1+MIN(MATCH(F29,(INT(LEFT(INDIRECT($S$3),FIND(\"-\",INDIRECT($S$3),1)-1))),1)),\nFALSE),\"\")","v":""},"",null,null,null,null,null,null,null,null,null,null,null,null,null,{"$f":"VLOOKUP($Q$1,'Availability Chart'!$AA$9:$AH$44,IF(H29=\"vertical\",8,7),FALSE)","v":2780},{"$f":"VLOOKUP($Q$1,'Availability Chart'!$AA$9:$AH$44,IF(H29=\"vertical\",7,8),FALSE)","v":2000},{"$f":"VLOOKUP($Q$1,'Availability Chart'!$AA$9:$AJ$44,IF(H29=\"vertical\",10,9),FALSE)","v":80},{"$f":"VLOOKUP($Q$1,'Availability Chart'!$AA$9:$AJ$44,IF(H29=\"vertical\",9,10),FALSE)","v":80}]
[null,null,11,null,null,null,null,null,"","","","",{"$f":"IFERROR(VLOOKUP(\nINDIRECT(\"Prices!C\"&$U$3+1+MIN(MATCH(E30,(INT(LEFT(INDIRECT($T$3),FIND(\"-\",INDIRECT($T$3),1)-1))),1))),\nINDIRECT($R$3),\n1+MIN(MATCH(F30,(INT(LEFT(INDIRECT($S$3),FIND(\"-\",INDIRECT($S$3),1)-1))),1)),\nFALSE),\"\")","v":""},"",null,null,null,null,null,null,null,null,null,null,null,null,null,{"$f":"VLOOKUP($Q$1,'Availability Chart'!$AA$9:$AH$44,IF(H30=\"vertical\",8,7),FALSE)","v":2780},{"$f":"VLOOKUP($Q$1,'Availability Chart'!$AA$9:$AH$44,IF(H30=\"vertical\",7,8),FALSE)","v":2000},{"$f":"VLOOKUP($Q$1,'Availability Chart'!$AA$9:$AJ$44,IF(H30=\"vertical\",10,9),FALSE)","v":80},{"$f":"VLOOKUP($Q$1,'Availability Chart'!$AA$9:$AJ$44,IF(H30=\"vertical\",9,10),FALSE)","v":80}]
[null,null,12,null,null,null,null,null,"","","","",{"$f":"IFERROR(VLOOKUP(\nINDIRECT(\"Prices!C\"&$U$3+1+MIN(MATCH(E31,(INT(LEFT(INDIRECT($T$3),FIND(\"-\",INDIRECT($T$3),1)-1))),1))),\nINDIRECT($R$3),\n1+MIN(MATCH(F31,(INT(LEFT(INDIRECT($S$3),FIND(\"-\",INDIRECT($S$3),1)-1))),1)),\nFALSE),\"\")","v":""},"",null,null,null,null,null,null,null,null,null,null,null,null,null,{"$f":"VLOOKUP($Q$1,'Availability Chart'!$AA$9:$AH$44,IF(H31=\"vertical\",8,7),FALSE)","v":2780},{"$f":"VLOOKUP($Q$1,'Availability Chart'!$AA$9:$AH$44,IF(H31=\"vertical\",7,8),FALSE)","v":2000},{"$f":"VLOOKUP($Q$1,'Availability Chart'!$AA$9:$AJ$44,IF(H31=\"vertical\",10,9),FALSE)","v":80},{"$f":"VLOOKUP($Q$1,'Availability Chart'!$AA$9:$AJ$44,IF(H31=\"vertical\",9,10),FALSE)","v":80}]
[null,null,13,null,null,null,null,null,"","","","",{"$f":"IFERROR(VLOOKUP(\nINDIRECT(\"Prices!C\"&$U$3+1+MIN(MATCH(E32,(INT(LEFT(INDIRECT($T$3),FIND(\"-\",INDIRECT($T$3),1)-1))),1))),\nINDIRECT($R$3),\n1+MIN(MATCH(F32,(INT(LEFT(INDIRECT($S$3),FIND(\"-\",INDIRECT($S$3),1)-1))),1)),\nFALSE),\"\")","v":""},"",null,null,null,null,null,null,null,null,null,null,null,null,null,{"$f":"VLOOKUP($Q$1,'Availability Chart'!$AA$9:$AH$44,IF(H32=\"vertical\",8,7),FALSE)","v":2780},{"$f":"VLOOKUP($Q$1,'Availability Chart'!$AA$9:$AH$44,IF(H32=\"vertical\",7,8),FALSE)","v":2000},{"$f":"VLOOKUP($Q$1,'Availability Chart'!$AA$9:$AJ$44,IF(H32=\"vertical\",10,9),FALSE)","v":80},{"$f":"VLOOKUP($Q$1,'Availability Chart'!$AA$9:$AJ$44,IF(H32=\"vertical\",9,10),FALSE)","v":80}]
[null,null,14,null,null,null,null,null,"","","","",{"$f":"IFERROR(VLOOKUP(\nINDIRECT(\"Prices!C\"&$U$3+1+MIN(MATCH(E33,(INT(LEFT(INDIRECT($T$3),FIND(\"-\",INDIRECT($T$3),1)-1))),1))),\nINDIRECT($R$3),\n1+MIN(MATCH(F33,(INT(LEFT(INDIRECT($S$3),FIND(\"-\",INDIRECT($S$3),1)-1))),1)),\nFALSE),\"\")","v":""},"",null,null,null,null,null,null,null,null,null,null,null,null,null,{"$f":"VLOOKUP($Q$1,'Availability Chart'!$AA$9:$AH$44,IF(H33=\"vertical\",8,7),FALSE)","v":2780},{"$f":"VLOOKUP($Q$1,'Availability Chart'!$AA$9:$AH$44,IF(H33=\"vertical\",7,8),FALSE)","v":2000},{"$f":"VLOOKUP($Q$1,'Availability Chart'!$AA$9:$AJ$44,IF(H33=\"vertical\",10,9),FALSE)","v":80},{"$f":"VLOOKUP($Q$1,'Availability Chart'!$AA$9:$AJ$44,IF(H33=\"vertical\",9,10),FALSE)","v":80}]
[null,null,15,null,null,null,null,null,"","","","",{"$f":"IFERROR(VLOOKUP(\nINDIRECT(\"Prices!C\"&$U$3+1+MIN(MATCH(E34,(INT(LEFT(INDIRECT($T$3),FIND(\"-\",INDIRECT($T$3),1)-1))),1))),\nINDIRECT($R$3),\n1+MIN(MATCH(F34,(INT(LEFT(INDIRECT($S$3),FIND(\"-\",INDIRECT($S$3),1)-1))),1)),\nFALSE),\"\")","v":""},"",null,null,null,null,null,null,null,null,null,null,null,null,null,{"$f":"VLOOKUP($Q$1,'Availability Chart'!$AA$9:$AH$44,IF(H34=\"vertical\",8,7),FALSE)","v":2780},{"$f":"VLOOKUP($Q$1,'Availability Chart'!$AA$9:$AH$44,IF(H34=\"vertical\",7,8),FALSE)","v":2000},{"$f":"VLOOKUP($Q$1,'Availability Chart'!$AA$9:$AJ$44,IF(H34=\"vertical\",10,9),FALSE)","v":80},{"$f":"VLOOKUP($Q$1,'Availability Chart'!$AA$9:$AJ$44,IF(H34=\"vertical\",9,10),FALSE)","v":80}]
[null,null,16,null,null,null,null,null,"","","","",{"$f":"IFERROR(VLOOKUP(\nINDIRECT(\"Prices!C\"&$U$3+1+MIN(MATCH(E35,(INT(LEFT(INDIRECT($T$3),FIND(\"-\",INDIRECT($T$3),1)-1))),1))),\nINDIRECT($R$3),\n1+MIN(MATCH(F35,(INT(LEFT(INDIRECT($S$3),FIND(\"-\",INDIRECT($S$3),1)-1))),1)),\nFALSE),\"\")","v":""},"",null,null,null,null,null,null,null,null,null,null,null,null,null,{"$f":"VLOOKUP($Q$1,'Availability Chart'!$AA$9:$AH$44,IF(H35=\"vertical\",8,7),FALSE)","v":2780},{"$f":"VLOOKUP($Q$1,'Availability Chart'!$AA$9:$AH$44,IF(H35=\"vertical\",7,8),FALSE)","v":2000},{"$f":"VLOOKUP($Q$1,'Availability Chart'!$AA$9:$AJ$44,IF(H35=\"vertical\",10,9),FALSE)","v":80},{"$f":"VLOOKUP($Q$1,'Availability Chart'!$AA$9:$AJ$44,IF(H35=\"vertical\",9,10),FALSE)","v":80}]
[null,null,17,null,null,null,null,null,"","","","",{"$f":"IFERROR(VLOOKUP(\nINDIRECT(\"Prices!C\"&$U$3+1+MIN(MATCH(E36,(INT(LEFT(INDIRECT($T$3),FIND(\"-\",INDIRECT($T$3),1)-1))),1))),\nINDIRECT($R$3),\n1+MIN(MATCH(F36,(INT(LEFT(INDIRECT($S$3),FIND(\"-\",INDIRECT($S$3),1)-1))),1)),\nFALSE),\"\")","v":""},"",null,null,null,null,null,null,null,null,null,null,null,null,null,{"$f":"VLOOKUP($Q$1,'Availability Chart'!$AA$9:$AH$44,IF(H36=\"vertical\",8,7),FALSE)","v":2780},{"$f":"VLOOKUP($Q$1,'Availability Chart'!$AA$9:$AH$44,IF(H36=\"vertical\",7,8),FALSE)","v":2000},{"$f":"VLOOKUP($Q$1,'Availability Chart'!$AA$9:$AJ$44,IF(H36=\"vertical\",10,9),FALSE)","v":80},{"$f":"VLOOKUP($Q$1,'Availability Chart'!$AA$9:$AJ$44,IF(H36=\"vertical\",9,10),FALSE)","v":80}]
[null,null,18,null,null,null,null,null,"","","","",{"$f":"IFERROR(VLOOKUP(\nINDIRECT(\"Prices!C\"&$U$3+1+MIN(MATCH(E37,(INT(LEFT(INDIRECT($T$3),FIND(\"-\",INDIRECT($T$3),1)-1))),1))),\nINDIRECT($R$3),\n1+MIN(MATCH(F37,(INT(LEFT(INDIRECT($S$3),FIND(\"-\",INDIRECT($S$3),1)-1))),1)),\nFALSE),\"\")","v":""},"",null,null,null,null,null,null,null,null,null,null,null,null,null,{"$f":"VLOOKUP($Q$1,'Availability Chart'!$AA$9:$AH$44,IF(H37=\"vertical\",8,7),FALSE)","v":2780},{"$f":"VLOOKUP($Q$1,'Availability Chart'!$AA$9:$AH$44,IF(H37=\"vertical\",7,8),FALSE)","v":2000},{"$f":"VLOOKUP($Q$1,'Availability Chart'!$AA$9:$AJ$44,IF(H37=\"vertical\",10,9),FALSE)","v":80},{"$f":"VLOOKUP($Q$1,'Availability Chart'!$AA$9:$AJ$44,IF(H37=\"vertical\",9,10),FALSE)","v":80}]
[null,null,19,null,null,null,null,null,"","","","",{"$f":"IFERROR(VLOOKUP(\nINDIRECT(\"Prices!C\"&$U$3+1+MIN(MATCH(E38,(INT(LEFT(INDIRECT($T$3),FIND(\"-\",INDIRECT($T$3),1)-1))),1))),\nINDIRECT($R$3),\n1+MIN(MATCH(F38,(INT(LEFT(INDIRECT($S$3),FIND(\"-\",INDIRECT($S$3),1)-1))),1)),\nFALSE),\"\")","v":""},"",null,null,null,null,null,null,null,null,null,null,null,null,null,{"$f":"VLOOKUP($Q$1,'Availability Chart'!$AA$9:$AH$44,IF(H38=\"vertical\",8,7),FALSE)","v":2780},{"$f":"VLOOKUP($Q$1,'Availability Chart'!$AA$9:$AH$44,IF(H38=\"vertical\",7,8),FALSE)","v":2000},{"$f":"VLOOKUP($Q$1,'Availability Chart'!$AA$9:$AJ$44,IF(H38=\"vertical\",10,9),FALSE)","v":80},{"$f":"VLOOKUP($Q$1,'Availability Chart'!$AA$9:$AJ$44,IF(H38=\"vertical\",9,10),FALSE)","v":80}]
[null,null,20,null,null,null,null,null,"","","","",{"$f":"IFERROR(VLOOKUP(\nINDIRECT(\"Prices!C\"&$U$3+1+MIN(MATCH(E39,(INT(LEFT(INDIRECT($T$3),FIND(\"-\",INDIRECT($T$3),1)-1))),1))),\nINDIRECT($R$3),\n1+MIN(MATCH(F39,(INT(LEFT(INDIRECT($S$3),FIND(\"-\",INDIRECT($S$3),1)-1))),1)),\nFALSE),\"\")","v":""},"",null,null,null,null,null,null,null,null,null,null,null,null,null,{"$f":"VLOOKUP($Q$1,'Availability Chart'!$AA$9:$AH$44,IF(H39=\"vertical\",8,7),FALSE)","v":2780},{"$f":"VLOOKUP($Q$1,'Availability Chart'!$AA$9:$AH$44,IF(H39=\"vertical\",7,8),FALSE)","v":2000},{"$f":"VLOOKUP($Q$1,'Availability Chart'!$AA$9:$AJ$44,IF(H39=\"vertical\",10,9),FALSE)","v":80},{"$f":"VLOOKUP($Q$1,'Availability Chart'!$AA$9:$AJ$44,IF(H39=\"vertical\",9,10),FALSE)","v":80}]
[null,null,null,null,null,"Sum of hinge holes",{"$f":"SUM(G20:G39)","v":0},null,null,null,null,null,1,{"$f":"IFERROR(G40*M40,\"\")","v":0}]
[null,null,null,null,null,null,null,null,null,null,null,null,"Subtotal",{"$f":"+SUM(N20:N40)","v":0}]
[null,null,null,"Please attach a drawing for grain match or hinge positions, if required.",null,null,null,null,null,null,null,null,"GST",{"$f":"+N41*0.1","v":0}]
[null,null,null,null,null,null,null,null,null,null,null,null,"Total",{"$f":"+N42+N41","v":0}]
[]
[null,false,null,"I agree that upon submission strictly no changes can be made to the order, if changes ",null,null,null,null,null,null,null,null,null,"TERMS & CONDITIONS"]
[null,null,null,"are made full charges may be incurred AND I agree to the terms and conditions"]
[null,null,null,null,null,null,null,null,null,null,null,null,null,{"$f":"JH!N47","v":"V1"}]

{"sheet":"EL","index":3,"n_rows":47,"n_cols":31,"rows_kept":47,"cut":false,"hidden":false,"merged":[[44,13,45,13],[44,3,44,8],[45,3,45,8],[1,3,1,8],[2,3,2,8],[4,5,4,7],[14,3,14,8],[15,3,15,8],[11,5,11,7],[5,5,5,7],[6,5,6,7],[7,5,7,7],[8,5,8,7],[9,5,9,7],[10,5,10,7],[17,3,18,3],[17,4,18,4],[17,5,18,5],[17,7,18,7],[17,8,18,8],[17,13,18,13],[9,3,9,4],[10,3,10,4],[11,3,11,4],[12,3,12,7],[4,3,4,4],[5,3,5,4],[6,3,6,4],[7,3,7,4],[8,3,8,4]]}
[null,null,12,null,null,null,null,null,null,null,null,null,null,null,null,null,20]
[]
[null,null,null,"Eurolight Order Form"]
[]
[null,null,null,"Company Name"]
[null,null,null,"Contact Person"]
[null,null,null,"Address"]
[null,null,null,"Customer Order #",null,null,null,null,null,null,null,null,null,null,null,null,"Plain"]
[null,null,null,"Phone #:"]
[null,null,null,"Email:"]
[null,null,null,"Other:"]
[null,null,null,"Date",null,{"$f":"TODAY()","v":"2020-09-01"}]
[null,null,null,"(automatically set to today when sending)"]
[]
[null,null,null,"Colour"]
[null,null,null,"W980 ST2 Platinum White"]
[]
[null,null,null,"Qty","HEIGHT (mm)","WIDTH (mm)",null,"Orientation","$/UNIT",null,null,null,null,"Total Price"]
[null,null,null,null,null,null,null,null,null,null,null,null,null,null,null,null,null,null,null,null,null,null,null,null,null,null,null,"Max Height","Max Width","Min Height","Min Width"]
[null,null,1,null,null,null,null,{"$f":"IF(D20<>0,\"Plain\",\"\")","v":""},{"$f":"IF(D20<>0,E20*F20*Prices!$B$280/1000000,\"\")","v":""},null,null,null,null,{"$f":"IFERROR(I20*D20,0)","v":0},null,null,null,null,null,null,null,null,null,null,null,null,null,{"$f":"VLOOKUP($Q$1,'Availability Chart'!$AA$9:$AH$44,IF(H20=\"vertical\",8,7),FALSE)","v":2780},{"$f":"VLOOKUP($Q$1,'Availability Chart'!$AA$9:$AH$44,IF(H20=\"vertical\",7,8),FALSE)","v":1200},{"$f":"VLOOKUP($Q$1,'Availability Chart'!$AA$9:$AJ$44,IF(H20=\"vertical\",10,9),FALSE)","v":80},{"$f":"VLOOKUP($Q$1,'Availability Chart'!$AA$9:$AJ$44,IF(H20=\"vertical\",9,10),FALSE)","v":80}]
[null,null,2,null,null,null,null,"",{"$f":"IF(D21<>0,E21*F21*Prices!$B$280/1000000,\"\")","v":""},null,null,null,null,{"$f":"IFERROR(I21*D21,0)","v":0},null,null,null,null,null,null,null,null,null,null,null,null,null,{"$f":"VLOOKUP($Q$1,'Availability Chart'!$AA$9:$AH$44,IF(H21=\"vertical\",8,7),FALSE)","v":2780},{"$f":"VLOOKUP($Q$1,'Availability Chart'!$AA$9:$AH$44,IF(H21=\"vertical\",7,8),FALSE)","v":1200},{"$f":"VLOOKUP($Q$1,'Availability Chart'!$AA$9:$AJ$44,IF(H21=\"vertical\",10,9),FALSE)","v":80},{"$f":"VLOOKUP($Q$1,'Availability Chart'!$AA$9:$AJ$44,IF(H21=\"vertical\",9,10),FALSE)","v":80}]
[null,null,3,null,null,null,null,"",{"$f":"IF(D22<>0,E22*F22*Prices!$B$280/1000000,\"\")","v":""},null,null,null,null,0,null,null,null,null,null,null,null,null,null,null,null,null,null,{"$f":"VLOOKUP($Q$1,'Availability Chart'!$AA$9:$AH$44,IF(H22=\"vertical\",8,7),FALSE)","v":2780},{"$f":"VLOOKUP($Q$1,'Availability Chart'!$AA$9:$AH$44,IF(H22=\"vertical\",7,8),FALSE)","v":1200},{"$f":"VLOOKUP($Q$1,'Availability Chart'!$AA$9:$AJ$44,IF(H22=\"vertical\",10,9),FALSE)","v":80},{"$f":"VLOOKUP($Q$1,'Availability Chart'!$AA$9:$AJ$44,IF(H22=\"vertical\",9,10),FALSE)","v":80}]
[null,null,4,null,null,null,null,"",{"$f":"IF(D23<>0,E23*F23*Prices!$B$280/1000000,\"\")","v":""},null,null,null,null,0,null,null,null,null,null,null,null,null,null,null,null,null,null,{"$f":"VLOOKUP($Q$1,'Availability Chart'!$AA$9:$AH$44,IF(H23=\"vertical\",8,7),FALSE)","v":2780},{"$f":"VLOOKUP($Q$1,'Availability Chart'!$AA$9:$AH$44,IF(H23=\"vertical\",7,8),FALSE)","v":1200},{"$f":"VLOOKUP($Q$1,'Availability Chart'!$AA$9:$AJ$44,IF(H23=\"vertical\",10,9),FALSE)","v":80},{"$f":"VLOOKUP($Q$1,'Availability Chart'!$AA$9:$AJ$44,IF(H23=\"vertical\",9,10),FALSE)","v":80}]
[null,null,5,null,null,null,null,"",{"$f":"IF(D24<>0,E24*F24*Prices!$B$280/1000000,\"\")","v":""},null,null,null,null,0,null,null,null,null,null,null,null,null,null,null,null,null,null,{"$f":"VLOOKUP($Q$1,'Availability Chart'!$AA$9:$AH$44,IF(H24=\"vertical\",8,7),FALSE)","v":2780},{"$f":"VLOOKUP($Q$1,'Availability Chart'!$AA$9:$AH$44,IF(H24=\"vertical\",7,8),FALSE)","v":1200},{"$f":"VLOOKUP($Q$1,'Availability Chart'!$AA$9:$AJ$44,IF(H24=\"vertical\",10,9),FALSE)","v":80},{"$f":"VLOOKUP($Q$1,'Availability Chart'!$AA$9:$AJ$44,IF(H24=\"vertical\",9,10),FALSE)","v":80}]
[null,null,6,null,null,null,null,"",{"$f":"IF(D25<>0,E25*F25*Prices!$B$280/1000000,\"\")","v":""},null,null,null,null,0,null,null,null,null,null,null,null,null,null,null,null,null,null,{"$f":"VLOOKUP($Q$1,'Availability Chart'!$AA$9:$AH$44,IF(H25=\"vertical\",8,7),FALSE)","v":2780},{"$f":"VLOOKUP($Q$1,'Availability Chart'!$AA$9:$AH$44,IF(H25=\"vertical\",7,8),FALSE)","v":1200},{"$f":"VLOOKUP($Q$1,'Availability Chart'!$AA$9:$AJ$44,IF(H25=\"vertical\",10,9),FALSE)","v":80},{"$f":"VLOOKUP($Q$1,'Availability Chart'!$AA$9:$AJ$44,IF(H25=\"vertical\",9,10),FALSE)","v":80}]
[null,null,7,null,null,null,null,"",{"$f":"IF(D26<>0,E26*F26*Prices!$B$280/1000000,\"\")","v":""},null,null,null,null,0,null,null,null,null,null,null,null,null,null,null,null,null,null,{"$f":"VLOOKUP($Q$1,'Availability Chart'!$AA$9:$AH$44,IF(H26=\"vertical\",8,7),FALSE)","v":2780},{"$f":"VLOOKUP($Q$1,'Availability Chart'!$AA$9:$AH$44,IF(H26=\"vertical\",7,8),FALSE)","v":1200},{"$f":"VLOOKUP($Q$1,'Availability Chart'!$AA$9:$AJ$44,IF(H26=\"vertical\",10,9),FALSE)","v":80},{"$f":"VLOOKUP($Q$1,'Availability Chart'!$AA$9:$AJ$44,IF(H26=\"vertical\",9,10),FALSE)","v":80}]
[null,null,8,null,null,null,null,"",{"$f":"IF(D27<>0,E27*F27*Prices!$B$280/1000000,\"\")","v":""},null,null,null,null,0,null,null,null,null,null,null,null,null,null,null,null,null,null,{"$f":"VLOOKUP($Q$1,'Availability Chart'!$AA$9:$AH$44,IF(H27=\"vertical\",8,7),FALSE)","v":2780},{"$f":"VLOOKUP($Q$1,'Availability Chart'!$AA$9:$AH$44,IF(H27=\"vertical\",7,8),FALSE)","v":1200},{"$f":"VLOOKUP($Q$1,'Availability Chart'!$AA$9:$AJ$44,IF(H27=\"vertical\",10,9),FALSE)","v":80},{"$f":"VLOOKUP($Q$1,'Availability Chart'!$AA$9:$AJ$44,IF(H27=\"vertical\",9,10),FALSE)","v":80}]
[null,null,9,null,null,null,null,"",{"$f":"IF(D28<>0,E28*F28*Prices!$B$280/1000000,\"\")","v":""},null,null,null,null,0,null,null,null,null,null,null,null,null,null,null,null,null,null,{"$f":"VLOOKUP($Q$1,'Availability Chart'!$AA$9:$AH$44,IF(H28=\"vertical\",8,7),FALSE)","v":2780},{"$f":"VLOOKUP($Q$1,'Availability Chart'!$AA$9:$AH$44,IF(H28=\"vertical\",7,8),FALSE)","v":1200},{"$f":"VLOOKUP($Q$1,'Availability Chart'!$AA$9:$AJ$44,IF(H28=\"vertical\",10,9),FALSE)","v":80},{"$f":"VLOOKUP($Q$1,'Availability Chart'!$AA$9:$AJ$44,IF(H28=\"vertical\",9,10),FALSE)","v":80}]
[null,null,10,null,null,null,null,"",{"$f":"IF(D29<>0,E29*F29*Prices!$B$280/1000000,\"\")","v":""},null,null,null,null,0,null,null,null,null,null,null,null,null,null,null,null,null,null,{"$f":"VLOOKUP($Q$1,'Availability Chart'!$AA$9:$AH$44,IF(H29=\"vertical\",8,7),FALSE)","v":2780},{"$f":"VLOOKUP($Q$1,'Availability Chart'!$AA$9:$AH$44,IF(H29=\"vertical\",7,8),FALSE)","v":1200},{"$f":"VLOOKUP($Q$1,'Availability Chart'!$AA$9:$AJ$44,IF(H29=\"vertical\",10,9),FALSE)","v":80},{"$f":"VLOOKUP($Q$1,'Availability Chart'!$AA$9:$AJ$44,IF(H29=\"vertical\",9,10),FALSE)","v":80}]
[null,null,11,null,null,null,null,"",{"$f":"IF(D30<>0,E30*F30*Prices!$B$280/1000000,\"\")","v":""},null,null,null,null,0,null,null,null,null,null,null,null,null,null,null,null,null,null,{"$f":"VLOOKUP($Q$1,'Availability Chart'!$AA$9:$AH$44,IF(H30=\"vertical\",8,7),FALSE)","v":2780},{"$f":"VLOOKUP($Q$1,'Availability Chart'!$AA$9:$AH$44,IF(H30=\"vertical\",7,8),FALSE)","v":1200},{"$f":"VLOOKUP($Q$1,'Availability Chart'!$AA$9:$AJ$44,IF(H30=\"vertical\",10,9),FALSE)","v":80},{"$f":"VLOOKUP($Q$1,'Availability Chart'!$AA$9:$AJ$44,IF(H30=\"vertical\",9,10),FALSE)","v":80}]
[null,null,12,null,null,null,null,"",{"$f":"IF(D31<>0,E31*F31*Prices!$B$280/1000000,\"\")","v":""},null,null,null,null,0,null,null,null,null,null,null,null,null,null,null,null,null,null,{"$f":"VLOOKUP($Q$1,'Availability Chart'!$AA$9:$AH$44,IF(H31=\"vertical\",8,7),FALSE)","v":2780},{"$f":"VLOOKUP($Q$1,'Availability Chart'!$AA$9:$AH$44,IF(H31=\"vertical\",7,8),FALSE)","v":1200},{"$f":"VLOOKUP($Q$1,'Availability Chart'!$AA$9:$AJ$44,IF(H31=\"vertical\",10,9),FALSE)","v":80},{"$f":"VLOOKUP($Q$1,'Availability Chart'!$AA$9:$AJ$44,IF(H31=\"vertical\",9,10),FALSE)","v":80}]
[null,null,13,null,null,null,null,"",{"$f":"IF(D32<>0,E32*F32*Prices!$B$280/1000000,\"\")","v":""},null,null,null,null,0,null,null,null,null,null,null,null,null,null,null,null,null,null,{"$f":"VLOOKUP($Q$1,'Availability Chart'!$AA$9:$AH$44,IF(H32=\"vertical\",8,7),FALSE)","v":2780},{"$f":"VLOOKUP($Q$1,'Availability Chart'!$AA$9:$AH$44,IF(H32=\"vertical\",7,8),FALSE)","v":1200},{"$f":"VLOOKUP($Q$1,'Availability Chart'!$AA$9:$AJ$44,IF(H32=\"vertical\",10,9),FALSE)","v":80},{"$f":"VLOOKUP($Q$1,'Availability Chart'!$AA$9:$AJ$44,IF(H32=\"vertical\",9,10),FALSE)","v":80}]
[null,null,14,null,null,null,null,"",{"$f":"IF(D33<>0,E33*F33*Prices!$B$280/1000000,\"\")","v":""},null,null,null,null,0,null,null,null,null,null,null,null,null,null,null,null,null,null,{"$f":"VLOOKUP($Q$1,'Availability Chart'!$AA$9:$AH$44,IF(H33=\"vertical\",8,7),FALSE)","v":2780},{"$f":"VLOOKUP($Q$1,'Availability Chart'!$AA$9:$AH$44,IF(H33=\"vertical\",7,8),FALSE)","v":1200},{"$f":"VLOOKUP($Q$1,'Availability Chart'!$AA$9:$AJ$44,IF(H33=\"vertical\",10,9),FALSE)","v":80},{"$f":"VLOOKUP($Q$1,'Availability Chart'!$AA$9:$AJ$44,IF(H33=\"vertical\",9,10),FALSE)","v":80}]
[null,null,15,null,null,null,null,"",{"$f":"IF(D34<>0,E34*F34*Prices!$B$280/1000000,\"\")","v":""},null,null,null,null,0,null,null,null,null,null,null,null,null,null,null,null,null,null,{"$f":"VLOOKUP($Q$1,'Availability Chart'!$AA$9:$AH$44,IF(H34=\"vertical\",8,7),FALSE)","v":2780},{"$f":"VLOOKUP($Q$1,'Availability Chart'!$AA$9:$AH$44,IF(H34=\"vertical\",7,8),FALSE)","v":1200},{"$f":"VLOOKUP($Q$1,'Availability Chart'!$AA$9:$AJ$44,IF(H34=\"vertical\",10,9),FALSE)","v":80},{"$f":"VLOOKUP($Q$1,'Availability Chart'!$AA$9:$AJ$44,IF(H34=\"vertical\",9,10),FALSE)","v":80}]
[null,null,16,null,null,null,null,"",{"$f":"IF(D35<>0,E35*F35*Prices!$B$280/1000000,\"\")","v":""},null,null,null,null,0,null,null,null,null,null,null,null,null,null,null,null,null,null,{"$f":"VLOOKUP($Q$1,'Availability Chart'!$AA$9:$AH$44,IF(H35=\"vertical\",8,7),FALSE)","v":2780},{"$f":"VLOOKUP($Q$1,'Availability Chart'!$AA$9:$AH$44,IF(H35=\"vertical\",7,8),FALSE)","v":1200},{"$f":"VLOOKUP($Q$1,'Availability Chart'!$AA$9:$AJ$44,IF(H35=\"vertical\",10,9),FALSE)","v":80},{"$f":"VLOOKUP($Q$1,'Availability Chart'!$AA$9:$AJ$44,IF(H35=\"vertical\",9,10),FALSE)","v":80}]
[null,null,17,null,null,null,null,"",{"$f":"IF(D36<>0,E36*F36*Prices!$B$280/1000000,\"\")","v":""},null,null,null,null,0,null,null,null,null,null,null,null,null,null,null,null,null,null,{"$f":"VLOOKUP($Q$1,'Availability Chart'!$AA$9:$AH$44,IF(H36=\"vertical\",8,7),FALSE)","v":2780},{"$f":"VLOOKUP($Q$1,'Availability Chart'!$AA$9:$AH$44,IF(H36=\"vertical\",7,8),FALSE)","v":1200},{"$f":"VLOOKUP($Q$1,'Availability Chart'!$AA$9:$AJ$44,IF(H36=\"vertical\",10,9),FALSE)","v":80},{"$f":"VLOOKUP($Q$1,'Availability Chart'!$AA$9:$AJ$44,IF(H36=\"vertical\",9,10),FALSE)","v":80}]
[null,null,18,null,null,null,null,"",{"$f":"IF(D37<>0,E37*F37*Prices!$B$280/1000000,\"\")","v":""},null,null,null,null,0,null,null,null,null,null,null,null,null,null,null,null,null,null,{"$f":"VLOOKUP($Q$1,'Availability Chart'!$AA$9:$AH$44,IF(H37=\"vertical\",8,7),FALSE)","v":2780},{"$f":"VLOOKUP($Q$1,'Availability Chart'!$AA$9:$AH$44,IF(H37=\"vertical\",7,8),FALSE)","v":1200},{"$f":"VLOOKUP($Q$1,'Availability Chart'!$AA$9:$AJ$44,IF(H37=\"vertical\",10,9),FALSE)","v":80},{"$f":"VLOOKUP($Q$1,'Availability Chart'!$AA$9:$AJ$44,IF(H37=\"vertical\",9,10),FALSE)","v":80}]
[null,null,19,null,null,null,null,"",{"$f":"IF(D38<>0,E38*F38*Prices!$B$280/1000000,\"\")","v":""},null,null,null,null,0,null,null,null,null,null,null,null,null,null,null,null,null,null,{"$f":"VLOOKUP($Q$1,'Availability Chart'!$AA$9:$AH$44,IF(H38=\"vertical\",8,7),FALSE)","v":2780},{"$f":"VLOOKUP($Q$1,'Availability Chart'!$AA$9:$AH$44,IF(H38=\"vertical\",7,8),FALSE)","v":1200},{"$f":"VLOOKUP($Q$1,'Availability Chart'!$AA$9:$AJ$44,IF(H38=\"vertical\",10,9),FALSE)","v":80},{"$f":"VLOOKUP($Q$1,'Availability Chart'!$AA$9:$AJ$44,IF(H38=\"vertical\",9,10),FALSE)","v":80}]
[null,null,20,null,null,null,null,"",{"$f":"IF(D39<>0,E39*F39*Prices!$B$280/1000000,\"\")","v":""},null,null,null,null,0,null,null,null,null,null,null,null,null,null,null,null,null,null,{"$f":"VLOOKUP($Q$1,'Availability Chart'!$AA$9:$AH$44,IF(H39=\"vertical\",8,7),FALSE)","v":2780},{"$f":"VLOOKUP($Q$1,'Availability Chart'!$AA$9:$AH$44,IF(H39=\"vertical\",7,8),FALSE)","v":1200},{"$f":"VLOOKUP($Q$1,'Availability Chart'!$AA$9:$AJ$44,IF(H39=\"vertical\",10,9),FALSE)","v":80},{"$f":"VLOOKUP($Q$1,'Availability Chart'!$AA$9:$AJ$44,IF(H39=\"vertical\",9,10),FALSE)","v":80}]
[]
[null,null,null,null,null,null,null,null,"Subtotal",null,null,null,null,{"$f":"+SUM(N20:N39)","v":0}]
[null,null,null,"Please attach a drawing for grain match or hinge positions, if required.",null,null,null,null,"GST",null,null,null,null,{"$f":"+N41*0.1","v":0}]
[null,null,null,null,null,null,null,null,"Total",null,null,null,null,{"$f":"+N42+N41","v":0}]
[]
[null,null,null,"I agree that upon submission strictly no changes can be made to the order, if",null,null,null,null,null,null,null,null,null,"TERMS & CONDITIONS"]
[null,null,null,"changes are made full charges may be incurred."]
[null,null,null,null,null,null,null,null,null,null,null,null,null,{"$f":"CE!N47","v":"V1"}]

{"sheet":"Prices","index":4,"n_rows":308,"n_cols":21,"rows_kept":308,"cut":false,"hidden":false,"merged":[[4,2,4,20],[5,1,12,1],[16,2,16,14],[17,1,29,1],[33,2,33,14],[34,1,47,1],[50,2,50,14],[51,1,64,1],[67,2,67,16],[68,1,79,1],[82,2,82,16],[83,1,94,1],[111,2,111,16],[112,1,123,1],[126,2,126,16],[98,1,108,1],[97,2,97,13],[127,1,138,1],[141,2,141,16],[142,1,153,1],[156,2,156,16],[157,1,168,1],[262,1,273,1],[277,1,288,1],[292,1,303,1],[307,1,307,3],[171,2,171,16],[172,1,183,1],[186,2,186,16],[187,1,198,1],[201,2,201,16],[202,1,213,1],[216,2,216,16],[217,1,228,1],[231,2,231,16],[232,1,243,1],[247,1,258,1]]}
[]
[null,"Price Lists"]
[]
[null,"J Handle Grey Beige Gladstone Oak"]
[null,1,"WIDTH (mm)"]
[null,"HEIGHT (mm)",null,"148-300","301-350","351-400","401-450","451-500","501-550","551-600","601-650","651-800","801-1000","1001-1200","1201-1490","1491-1700","1701-1900","1901-2100","2101-2400","2401-2600","2601-2790"]
[null,null,"148-200",26.945559081818971,28.324281584210063,29.703004086601169,31.045444417876698,32.412072863229277,33.778701308581859,35.157423810972951,36.511958199287015,40.648125706460306,46.10254543083208,51.556965155203898,64.016565067711497,73.039033969872193,81.631861495739486,90.224689021606821,123.73671637248935,134.04810940353011,143.84393278301886]
[null,null,"201-400",34.504344730892967,36.923156138596639,39.354061603338842,41.772873011042513,44.179590361707668,46.610495826449856,49.029307234153549,51.47230675593427,58.716646922006774,68.391892552821474,78.055044126597679,96.918346457192101,110.57797917934673,123.58715320044632,136.59632722154595,187.33210590383442,202.94311472915393,217.77357311320753]
[null,null,"401-600",42.099412551082523,45.558312864098781,49.029307234153556,52.536583775323884,55.995484088340163,59.4543844013564,62.925378771411182,66.384279084427433,76.821450308668815,90.705427788887931,104.58940526910703,129.86517820914125,148.16832413123498,165.59989167608617,183.03145922093731,251.01457264585687,271.93245369967832,291.8044407008087]
[null,null,"601-750",47.771525302147644,52.052821493783135,56.285741457264592,60.56703764890009,64.812051669420057,69.057065689940003,73.350455938614033,77.607564016172503,90.378888248847915,107.43150867315887,124.45994098339271,154.53776005437928,176.31824972647303,197.06157322370515,217.80489672093725,298.70385836014248,323.59584655682107,347.24323534366562]
[null,null,"751-900",53.467826167289786,58.523142009390483,63.542175680375621,68.585397465437779,73.652807364576972,78.696029149639145,83.751344991739828,88.806660833840553,103.93632618902701,124.15758955742979,144.34257075471697,179.22535868710693,204.48530856918239,228.54240369496853,252.59949882075472,346.42216981132071,375.29068396226415,402.7157724056604]
[null,null,"901-1200",64.812051669420043,71.463783040605179,78.055044126597693,84.694681440744276,91.310130640813853,97.949767954960436,104.58940526910703,111.20485446917657,131.11167235457788,157.59765726893315,184.11992435440396,228.61557274005162,260.8365595020723,291.52321356113964,322.20986762020692,441.88781845056951,478.7118033214503,513.6945889487871]
[null,null,"1201-1490",75.672595517056493,83.829714481349455,91.98683344564239,100.14395240993537,108.30107137422834,116.42215004854648,124.59128244283106,132.73638797713241,157.19573144001973,189.81219386719997,218.18791550734716,270.91666175495612,309.09954696874183,345.46419955329964,381.82885213785761,523.65099721763318,567.28858031910261,608.74428426549855]
[]
[]
[null,"J Handle Premium White Gloss"]
[null,2,"WIDTH (mm)"]
[null,"HEIGHT (mm)",null,"148-300","301-350","351-400","401-450","451-500","501-550","551-600","601-650","651-800","801-1000","1001-1200","1201-1490"]
[null,null,"148-200",14.857096503116511,15.889735704028167,16.928828899945529,17.974376090868581,19.013469286785934,20.059016477708987,21.098109673626354,22.143656864549406,25.267390447307182,29.430217225982311,33.586590009651744,41.703349261984251]
[null,null,"201-400",29.714193006233018,31.779471408056335,33.857657799891058,35.948752181737163,38.026938573571869,40.118032955417974,42.196219347252708,44.287313729098813,50.534780894614357,58.860434451964622,67.173180019303487,83.406698523968487]
[null,null,"401-600",36.232727961987869,39.201565664608893,42.196219347252708,45.190873029896508,48.211342692563122,51.154364415161346,54.149018097805154,57.130763790437591,66.114724838369028,78.080431578932888,90.00741434946255,111.75920615058268]
[null,null,"601-750",41.124856176306857,44.777817349531858,48.430778522756853,52.135371656027417,55.77542483924104,59.454201992488819,63.132979145736606,66.785940318961607,77.783547808670789,92.459932451627722,107.11050111456194,132.99553888391438]
[null,null,"751-900",46.016984390625836,50.35406903445481,54.69115367828379,59.041146312124141,63.378230955953129,67.728223589793487,72.078216223633845,76.415300867462832,89.46527876898395,106.86524930434541,124.22649586967266,154.24789903817691]
[null,null,"901-1200",55.775424839241019,61.506572404300741,67.173180019303487,72.917235574374587,78.583843189377333,84.289174774414192,90.00741434946255,95.712745934499495,112.81583269959884,135.63715903974651,158.45848537989417,196.75261934670198]
[null,null,"1201-1500",65.572589257890414,72.607443814101089,79.693930330357375,86.754600866590792,93.802363412812895,100.87594193905775,107.94952046530264,114.98437502151333,136.19220261023659,164.44779274518183,188.99878974685652,234.67349726901347]
[null,null,"1501-1800",75.343937696516974,83.772855173958419,92.175956671377037,100.60487414881847,109.02088363624848,117.4498011136899,125.85290261110853,134.26891209853858,159.56857252087426,193.24551846060581,223.47603106729454,277.48273857522412]
[null,null,"1801-2100",85.089470155120779,94.899542563781537,104.68379899241954,114.46805542105751,124.22649586967268,134.01075229831062,143.78210073693725,153.592173145598,182.91912645148915,222.03033618601825,256.85609323676397,318.9296491023153]
[null,null,"2101-2400",113.87945107653786,127.24696553233929,140.61447998814074,153.99748403195585,167.33401931172992,180.70153376753134,194.08453781134642,207.45205226714793,247.52361645852491,302.43420596700247,341.56090528954513,424.10479073451864]
[null,null,"2401-2600",123.36940533291602,137.85087932670089,152.33235332048579,166.83060770128549,181.27852092104075,195.75999491482563,224.72294290239543,224.73972328941025,268.15058449673535,327.63705646425257,370.0243140636739,459.4468566290617]
[null,null,"2601-2790",132.38486187647524,147.92459743134444,163.46433298621358,179.02207518714866,194.52579744988606,210.0655330047552,241.1450041144935,241.16301076055942,287.74620413303518,351.57976443664035,397.06455239909621,493.02181922887786]
[]
[]
[null,"J Handle Premium White"]
[null,3,"WIDTH (mm)"]
[null,"HEIGHT (mm)",null,"148-300","301-350","351-400","401-450","451-500","501-550","551-600","601-650","651-800","801-1000","1001-1200","1201-1490"]
[null,null,"148-200",13.660801441897068,14.610292419613634,15.565717715940925,16.527077330878946,17.482502627206241,18.443862242144252,20.360647153409577,20.360647153409577,23.232857361002182,27.060492864922082,30.882194050231245,38.345390945703805]
[null,null,"201-400",27.321602883794135,29.220584839227264,31.131435431881854,33.054154661757892,34.965005254412475,36.887724484288512,40.721294306819154,40.721294306819146,46.465714722004357,54.120985729844158,61.764388100462497,76.69078189140761]
[null,null,"401-600",33.315264680629951,36.045051241565062,38.798575076943102,41.552098912321142,44.329360022142083,47.0354093086343,52.530588342168897,52.530588342168912,60.791159848303018,71.793386552593702,82.760007345220018,102.76034245364819]
[null,null,"601-750",37.813478187562168,41.172302521234521,44.531126854906859,47.937425737465034,51.284381433915918,54.666943042031178,61.408328983818791,61.408328983818791,71.520407896500188,85.015048417296839,98.485951663650638,122.28672331569952]
[null,null,"751-900",42.311691694494378,46.299553800903951,50.28741590731353,54.287146650944543,58.275008757354129,62.274739500985142,70.262332351025748,70.262332351025734,82.261524581918835,98.260447556442926,114.22376461930264,141.82784106896744]
[null,null,"901-1200",51.284381433915918,56.554056360242846,61.764388100462497,67.045931664010894,72.256263404230523,77.502201056114529,88.005944997104024,88.005944997104052,103.73188931553463,124.71563992307068,145.69939053060673,180.91007657550335]
[null,null,"1201-1500",60.292677085001827,66.761084370695912,73.276966205275841,79.769110765412833,86.249386688328386,92.753399885686832,105.72582036873942,105.72582036873942,125.22599132359335,151.20643820136283,173.78058619657412,215.77756119407951]
[null,null,"1501-1800",69.277235461644807,77.027455567256283,84.753938398424808,92.504158504036269,100.24250997242625,107.9927300780377,123.45756437759624,123.45756437759624,146.72009333165209,177.68536784243355,205.48171621508595,255.13979763373169]
[null,null,"1801-2100",78.238056563844907,87.25822085215222,95.067784143870966,105.25107487988114,114.22376461930264,123.22019163316709,141.22491429811748,141.22491429811743,168.19045806526788,204.15242884628273,236.17401206977391,293.24939831996926]
[null,null,"2101-2400",104.70986502258272,117.0010257291236,129.29218643566455,141.59758950687123,153.8602654840806,166.15142619062158,190.73374760370339,190.74798996836915,227.59298735866042,278.08217009873869,314.0583832444193,389.9558258618207]
[null,null,"2401-2600",113.43568710779793,126.7511112065506,140.06653530530326,153.39738863244378,166.68195427442072,179.99737837317335,206.62822657067869,206.64365579906655,246.55906963854881,301.25568427363368,340.22991518145426,422.45214468363912]
[null,null,"2601-2790",121.7252180887524,136.01369241010619,150.30216673146006,164.60719780173778,178.86255862524374,193.15103294659755,221.72798158930522,221.74453833822912,264.57684780444282,323.27052273978376,365.09287052163751,453.32364756436652]
[]
[]
[null,"J Handle Perfect Sense"]
[null,4,"WIDTH (mm)"]
[null,"HEIGHT (mm)",null,"148-300","301-350","351-400","401-450","451-500","501-550","551-600","601-650","651-800","801-1000","1001-1200","1201-1490"]
[null,null,"148-200",20.487505142397676,21.927625573844832,23.361229623249255,24.788317290610927,26.215404957972581,27.662041771462498,29.09564582086692,30.542282634356834,34.849611164612838,40.590543744273248,46.344509088019166,57.544432117623778]
[null,null,"201-400",40.975010284795346,43.855251147689664,46.722459246498502,49.576634581221846,52.430809915945176,55.324083542924988,58.191291641733841,61.084565268713661,69.699222329225663,81.181087488546495,92.689018176038331,115.08886423524757]
[null,null,"401-600",49.954584739701183,54.099003718888497,58.191291641733841,62.322677856835668,66.427998543766492,70.572417522953799,74.677738209884637,78.835189953157453,91.203283070291945,107.66366411027172,124.13707791433707,154.13687174363517]
[null,null,"601-750",56.705556535987455,61.775301765244883,66.805948702245843,71.888726695588772,76.945439160760714,79.369533280662736,87.07189685519009,92.128609320362031,107.31177947996338,127.4995310483947,147.73941367316792,183.44310531085017]
[null,null,"751-900",63.443495568188204,69.425534283430281,75.446671290928847,81.428710006170888,87.423781485498466,93.41885296482603,99.413924444153594,105.40899592348114,123.40724312554931,147.3744962787741,171.3547821960843,212.76552122680471]
[null,null,"901-1200",76.945439160760714,84.817228668399508,92.689018176038331,100.57384044776261,108.41956442723041,116.27832117078373,124.13707791433707,132.02190018606132,155.62423594489223,187.08532844727645,218.59855200600262,271.42653540745323]
[null,null,"1201-1500",90.421317225162241,100.16982476111228,109.91833229706232,119.64077430484136,129.40231460487692,139.16385490491245,148.88629691269151,158.63480444864149,187.82819600014966,226.83525890803529,265.79019075957893,330.02282019314379]
[null,null,"1501-1800",103.93629358182024,115.54848638199603,127.1476464180863,138.75983921826207,150.33293372618138,161.99725758269915,173.62248314696041,185.22164318305067,220.09731987583453,266.54609107653755,364.57854252762883,452.68502363847244]
[null,null,"1801-2100",117.39913888213627,130.88804971062331,144.38999330319581,157.87890413168282,171.35478219608433,184.8567257886568,198.34563661714387,211.84758020971637,252.28824716700646,306.24389048095452,416.52714017241067,517.18786571407645]
[null,null,"2101-2400",157.06565965274794,175.50441428090579,193.92752959216116,212.39756285412423,230.80503884847695,249.2594327935374,267.68254810479277,286.1213027329506,341.42192730052176,415.14566717934815,562.13960674682585,697.99001171064197]
[null,null,"2401-2600",170.15446462381024,190.12978213764799,210.08815705817457,230.09735975863455,250.03879208584999,270.03105219299886,289.98942711352544,309.96474462736313,369.87375457556521,449.74113944429382,608.98457397572793,756.15584601986222]
[null,null,"2601-2790",182.58882934631944,204.02388160155303,225.44075315088736,246.91216681791943,268.31085766135442,289.76409062248723,311.18096217182159,332.61601442705506,396.90299048685654,482.60683809599215,653.48729284318495,811.41338861362135]
[]
[]
[null,"Wardrobe Range 16mm"]
[null,5,"WIDTH (mm)"]
[null,"HEIGHT (mm)",null,"80-200","201-300","301-350","351-400","401-450","451-500","501-550","551-600","601-650","651-900","901-1300","1301-1500","1501-1800","1801-2000"]
[null,null,"80-200",13.84,15.32,16.100000000000001,16.87,17.64,18.420000000000002,19.2,19.98,20.75,25.99,34.049999999999997,36.619999999999997,43.5,47.85]
[null,null,"201-400",17.95,20.55,20.61,21.96,23.31,24.66,26.02,27.37,28.73,36.86,49.61,55.45,65.87,72.459999999999994]
[null,null,"401-600",19.989999999999998,21.94,24.61,26.49,27.91,30.26,32.119999999999997,33.99,35.270000000000003,48.02,61.43,67.180000000000007,79.92,88.2]
[null,null,"601-750",22.43,22.98,25.03,26.06,28.59,31.23,33.159999999999997,34.24,36.39,49.01,62.06,71.38,85.27,90.44]
[null,null,"751-900",25.76,26.75,28.14,29.43,31.98,34.89,36.950000000000003,38.76,41.15,52.97,65.69,73.44,87.24,95.96]
[null,null,"901-1200",28.8,32.299999999999997,33.770000000000003,34.46,37.21,38.549999999999997,39.869999999999997,42.57,45.27,60.03,83.39,93.67,111.28,122.41]
[null,null,"1201-1500",27.98,31.01,35.799999999999997,37.69,41.03,44.37,47.71,51.05,54.39,72.459999999999994,101.1,111.75,132.75,146.03]
[null,null,"1501-1800",31.56,35.64,39.619999999999997,43.59,47.58,51.57,55.55,59.53,63.5,84.9,118.81,132.12,156.96,172.65]
[null,null,"1801-2100",35.17,40.25,44.88,49.51,54.14,58.75,63.38,68.010000000000005,72.63,97.33,136.5,151.83000000000001,180.38,198.41]
[null,null,"2101-2400",39.380000000000003,45.08,50.27,55.45,60.63,65.8,70.989999999999995,76.17,81.34,109,152.88,170.05,202.02,222.22]
[null,null,"2401 - 2780",44.71,51.18,57.06,62.95,68.83,74.69,80.58,86.46,92.34,123.74,173.55,193.04,229.33,257.41000000000003]
[]
[null,"Wardrobe Range 25mm"]
[null,6,"WIDTH (mm)"]
[null,"HEIGHT (mm)",null,"80-200","201-300","301-350","351-400","401-450","451-500","501-550","551-600","601-650","651-900","901-1300","1301-1500","1501-1800","1801-2000"]
[null,null,"80-200",17.07,18.899999999999999,19.87,20.81,21.76,22.72,23.68,24.64,25.6,32.06,42,45.18,53.67,59.03]
[null,null,"201-400",22.14,25.35,25.42,27.1,28.76,30.42,32.1,33.76,35.44,45.48,61.2,68.400000000000006,81.260000000000005,89.39]
[null,null,"401-600",24.65,27.06,30.36,32.68,34.43,37.32,39.619999999999997,41.93,43.51,59.24,75.78,82.88,98.59,108.8]
[null,null,"601-750",27.67,28.34,30.88,32.15,35.270000000000003,38.520000000000003,40.909999999999997,42.24,44.9,60.46,76.56,88.06,105.19,111.57]
[null,null,"751-900",31.78,33,34.72,36.299999999999997,39.450000000000003,43.04,45.59,47.82,50.77,65.34,81.040000000000006,90.59,107.62,118.39]
[null,null,"901-1200",35.520000000000003,39.85,41.65,42.5,45.9,47.55,49.18,52.51,55.84,74.06,102.87,115.56,137.28,151.01]
[null,null,"1201-1500",34.520000000000003,38.25,44.17,46.5,50.62,54.74,58.85,62.98,67.099999999999994,89.39,124.73,137.86000000000001,163.77000000000001,180.15]
[null,null,"1501-1800",38.94,43.96,48.88,53.78,58.7,63.62,68.53,73.430000000000007,78.34,104.73,146.57,162.99,193.63,212.99]
[null,null,"1801-2100",43.38,49.66,55.37,61.08,66.790000000000006,72.48,78.19,83.9,89.6,120.07,168.4,187.31,222.52,244.77]
[null,null,"2101-2400",48.59,55.62,62.01,68.41,74.8,81.17,87.57,93.96,100.35,134.47,188.6,209.79,249.23,274.14999999999998]
[null,null,"2401 - 2780",55.15,63.13,70.39,77.650000000000006,84.91,92.14,99.41,106.66,113.91,152.65,214.1,238.14,282.91000000000003,317.55]
[]
[null,"Melamine Plain (Essential Range) 8x4 16mm"]
[null,7,"WIDTH (mm)"]
[null,"HEIGHT (mm)",null,"80-200","201-300","301-350","351-400","401-450","451-500","501-550","551-600","601-650","651-900","901-1200"]
[null,null,"80-200",10.57,11.7,12.3,12.89,13.47,14.07,14.66,15.26,15.85,19.850000000000001,24]
[null,null,"201-400",13.71,15.69,15.74,16.78,17.809999999999999,18.829999999999998,19.87,20.9,21.94,28.16,34.975384615384613]
[null,null,"401-600",15.27,16.75,18.8,20.23,21.32,23.11,24.53,25.96,26.94,36.68,43.310769230769232]
[null,null,"601-750",17.14,17.55,19.12,19.91,21.84,23.85,25.33,26.15,27.8,37.44,43.753846153846148]
[null,null,"751-900",19.68,20.43,21.49,22.48,24.43,26.65,28.22,29.61,31.43,40.450000000000003,46.310769230769232]
[null,null,"901-1200",21.99,24.67,25.79,26.32,28.42,29.44,30.45,32.51,34.57,45.85,58.790769230769229]
[null,null,"1201-1500",21.37,23.68,27.34,28.79,31.34,33.89,36.44,38.99,41.54,55.34,71.28]
[null,null,"1501-1800",24.11,27.22,30.26,33.299999999999997,36.340000000000003,39.39,42.43,45.47,48.5,64.84,83.759999999999991]
[null,null,"1801-2100",26.86,30.75,34.28,37.81,41.35,44.87,48.41,51.94,55.47,74.33,96.24]
[null,null,"2101-2400",30.08,34.43,38.39,42.35,46.31,50.26,54.22,58.17,62.13,83.25,107.7876923076923]
[]
[null,"Melamine Plain (Essential Range) Jumbo 16mm"]
[null,8,"WIDTH (mm)"]
[null,"HEIGHT (mm)",null,"80-200","201-300","301-350","351-400","401-450","451-500","501-550","551-600","601-650","651-900","901-1300","1301-1500","1501-1800","1801-2000"]
[null,null,"80-200",10.57,11.7,12.3,12.89,13.47,14.07,14.66,15.26,15.85,19.850000000000001,26,27.97,33.229999999999997,36.549999999999997]
[null,null,"201-400",13.71,15.69,15.74,16.78,17.809999999999999,18.829999999999998,19.87,20.9,21.94,28.16,37.89,42.35,50.31,55.34]
[null,null,"401-600",15.27,16.75,18.8,20.23,21.32,23.11,24.53,25.96,26.94,36.68,46.92,51.31,61.04,67.36]
[null,null,"601-750",17.14,17.55,19.12,19.91,21.84,23.85,25.33,26.15,27.8,37.44,47.4,54.52,65.13,69.069999999999993]
[null,null,"751-900",19.68,20.43,21.49,22.48,24.43,26.65,28.22,29.61,31.43,40.450000000000003,50.17,56.09,66.63,73.290000000000006]
[null,null,"901-1200",21.99,24.67,25.79,26.32,28.42,29.44,30.45,32.51,34.57,45.85,63.69,71.540000000000006,84.99,93.49]
[null,null,"1201-1500",21.37,23.68,27.34,28.79,31.34,33.89,36.44,38.99,41.54,55.34,77.22,85.35,101.39,111.53]
[null,null,"1501-1800",24.11,27.22,30.26,33.299999999999997,36.340000000000003,39.39,42.43,45.47,48.5,64.84,90.74,100.91,119.88,131.87]
[null,null,"1801-2100",26.86,30.75,34.28,37.81,41.35,44.87,48.41,51.94,55.47,74.33,104.26,115.97,137.77000000000001,151.54]
[null,null,"2101-2400",30.08,34.43,38.39,42.35,46.31,50.26,54.22,58.17,62.13,83.25,116.77,129.88,154.30000000000001,169.73]
[null,null,"2401 - 2780",34.15,39.090000000000003,43.58,48.08,52.57,57.05,61.55,66.040000000000006,70.52,94.51,132.55000000000001,147.44,175.15,196.6]
[]
[null,"Melamine Plain (Builders & Zoom) 16mm"]
[null,9,"WIDTH (mm)"]
[null,"HEIGHT (mm)",null,"80-200","201-300","301-350","351-400","401-450","451-500","501-550","551-600","601-650","651-900","901-1300","1301-1500","1501-1800","1801-2000"]
[null,null,"80-200",13.59,15.05,15.81,16.57,17.32,18.09,18.850000000000001,19.62,20.38,25.52,33.43,35.96,42.72,46.99]
[null,null,"201-400",17.62,20.18,20.239999999999998,21.57,22.89,24.21,25.55,26.87,28.21,36.200000000000003,48.72,54.45,64.680000000000007,71.150000000000006]
[null,null,"401-600",19.63,21.54,24.17,26.01,27.41,29.71,31.54,33.380000000000003,34.64,47.16,60.32,65.97,78.48,86.61]
[null,null,"601-750",22.03,22.56,24.58,25.59,28.07,30.66,32.57,33.619999999999997,35.74,48.13,60.94,70.099999999999994,83.73,88.81]
[null,null,"751-900",25.3,26.27,27.63,28.9,31.4,34.26,36.29,38.06,40.409999999999997,52.01,64.510000000000005,72.11,85.67,94.23]
[null,null,"901-1200",28.28,31.72,33.159999999999997,33.83,36.54,37.85,39.15,41.8,44.45,58.95,81.88,91.98,109.27,120.2]
[null,null,"1201-1500",27.48,30.45,35.159999999999997,37.01,40.29,43.57,46.85,50.13,53.41,71.150000000000006,99.28,109.73,130.36000000000001,143.4]
[null,null,"1501-1800",30.99,34.99,38.909999999999997,42.81,46.73,50.64,54.55,58.45,62.36,83.37,116.66,129.74,154.13,169.54]
[null,null,"1801-2100",34.53,39.53,44.07,48.62,53.16,57.69,62.24,66.78,71.319999999999993,95.57,134.04,149.1,177.13,194.84]
[null,null,"2101-2400",38.67,44.27,49.36,54.45,59.54,64.61,69.709999999999994,74.790000000000006,79.88,107.04,150.13,166.99,198.38,218.22]
[null,null,"2401 - 2780",43.9,50.25,56.03,61.81,67.59,73.349999999999994,79.13,84.9,90.67,121.51,170.42,189.56,225.19,252.77]
[]
[null,"Melamine Woodgrain (Builders, Zoom & Essential) 16mm"]
[null,10,"WIDTH (mm)"]
[null,"HEIGHT (mm)",null,"80-200","201-300","301-350","351-400","401-450","451-500","501-550","551-600","601-650","651-900","901-1300","1301-1500","1501-1800","1801-2000"]
[null,null,"80-200",16.07,17.79,18.7,19.59,20.48,21.39,22.29,23.19,24.09,30.17,39.53,42.52,50.51,55.56]
[null,null,"201-400",20.84,23.86,23.93,25.5,27.07,28.63,30.21,31.77,33.36,42.8,57.6,64.38,76.48,84.13]
[null,null,"401-600",23.2,25.47,28.58,30.76,32.4,35.130000000000003,37.29,39.46,40.950000000000003,55.76,71.319999999999993,78,92.79,102.4]
[null,null,"601-750",26.05,26.68,29.07,30.26,33.19,36.25,38.5,39.75,42.25,56.91,72.06,82.88,99,105]
[null,null,"751-900",29.91,31.05,32.67,34.17,37.130000000000003,40.5,42.9,45,47.78,61.5,76.27,85.27,101.29,111.42]
[null,null,"901-1200",33.43,37.5,39.200000000000003,40,43.2,44.75,46.29,49.42,52.56,69.7,96.82,108.76,129.19999999999999,142.12]
[null,null,"1201-1500",32.49,36,41.57,43.76,47.64,51.52,55.39,59.28,63.15,84.13,117.39,129.75,154.13999999999999,169.55]
[null,null,"1501-1800",36.65,41.38,46,50.62,55.25,59.88,64.5,69.12,73.73,98.57,137.94,153.4,182.24,200.46]
[null,null,"1801-2100",40.83,46.74,52.11,57.49,62.86,68.209999999999994,73.59,78.959999999999994,84.33,113,158.49,176.29,209.43,230.38]
[null,null,"2101-2400",45.73,52.35,58.36,64.38,70.400000000000006,76.400000000000006,82.42,88.43,94.45,126.56,177.51,197.45,234.57,258.02]
[null,null,"2401 - 2780",51.91,59.42,66.25,73.08,79.92,86.72,93.56,100.39,107.21,143.66999999999999,201.5,224.13,266.27,298.87]
[]
[null,"Melamine Fantasy & ST30 16mm"]
[null,11,"WIDTH (mm)"]
[null,"HEIGHT (mm)",null,"80-200","201-300","301-350","351-400","401-450","451-500","501-550","551-600","601-650","651-900","901-1300","1301-1500","1501-1800","1801-2000"]
[null,null,"80-200",19.5,21.59,22.69,23.77,24.85,25.95,27.05,28.15,29.24,36.619999999999997,47.97,51.6,61.3,67.430000000000007]
[null,null,"201-400",25.29,28.95,29.04,30.95,32.85,34.74,36.659999999999997,38.56,40.479999999999997,51.94,69.91,78.13,92.81,102.1]
[null,null,"401-600",28.16,30.91,34.68,37.33,39.33,42.63,45.26,47.89,49.7,67.67,86.55,94.67,112.61,124.28]
[null,null,"601-750",31.61,32.369999999999997,35.270000000000003,36.72,40.28,44,46.73,48.25,51.28,69.06,87.45,100.58,120.15,127.43]
[null,null,"751-900",36.299999999999997,37.69,39.65,41.46,45.06,49.16,52.07,54.62,57.98,74.63,92.56,103.48,122.93,135.22]
[null,null,"901-1200",40.57,45.51,47.58,48.55,52.43,54.31,56.17,59.98,63.78,84.59,117.5,131.99,156.80000000000001,172.48]
[null,null,"1201-1500",39.43,43.69,50.44,53.11,57.81,62.52,67.22,71.94,76.64,102.1,142.46,157.46,187.06,205.77]
[null,null,"1501-1800",44.47,50.21,55.83,61.43,67.05,72.66,78.27,83.88,89.48,119.63,167.41,186.17,221.17,243.28]
[null,null,"1801-2100",49.55,56.72,63.24,69.760000000000005,76.28,82.78,89.31,95.82,102.34,137.13999999999999,192.34,213.95,254.17,279.58]
[null,null,"2101-2400",55.49,63.53,70.83,78.13,85.44,92.71,100.03,107.32,114.62,153.6,215.42,239.62,284.67,313.13]
[null,null,"2401 - 2780",62.99,72.11,80.400000000000006,88.69,96.98,105.25,113.55,121.83,130.11000000000001,174.36,244.54,272.01,323.14,362.71]
[]
[null,"Melamine Mattwood 18mm"]
[null,12,"WIDTH (mm)"]
[null,"HEIGHT (mm)",null,"80-200","201-300","301-350","351-400","401-450","451-500","501-550","551-600","601-650","651-900","901-1300","1301-1500","1501-1800","1801-2000"]
[null,null,"80-200",22.64,25.07,26.35,27.6,28.86,30.14,31.41,32.69,33.96,42.52,55.71,59.92,71.19,78.3]
[null,null,"201-400",29.37,33.619999999999997,33.72,35.94,38.14,40.35,42.58,44.78,47.01,60.32,81.180000000000007,90.73,107.78,118.56]
[null,null,"401-600",32.700000000000003,35.89,40.270000000000003,43.35,45.67,49.51,52.56,55.62,57.72,78.58,100.51,109.93,130.78,144.32]
[null,null,"601-750",36.71,37.590000000000003,40.96,42.65,46.78,51.09,54.26,56.03,59.55,80.2,101.55,116.8,139.53,147.97999999999999]
[null,null,"751-900",42.16,43.76,46.05,48.15,52.33,57.08,60.47,63.42,67.34,86.67,107.49,120.16,142.75,157.03]
[null,null,"901-1200",47.12,52.85,55.25,56.38,60.89,63.07,65.23,69.650000000000006,74.069999999999993,98.23,136.44999999999999,153.28,182.09,200.3]
[null,null,"1201-1500",45.78,50.74,58.58,61.67,67.14,72.599999999999994,78.06,83.54,89,118.57,165.44,182.86,217.23,238.95]
[null,null,"1501-1800",51.64,58.31,64.83,71.33,77.86,84.38,90.89,97.4,103.91,138.91999999999999,194.41,216.19,256.83999999999997,282.52]
[null,null,"1801-2100",57.54,65.87,73.44,81.010000000000005,88.59,96.13,103.72,111.28,118.84,159.26,223.36,248.45,295.16000000000003,324.68]
[null,null,"2101-2400",64.44,73.77,82.25,90.73,99.22,107.67,116.16,124.63,133.1,178.37,250.17,278.27,330.58,363.64]
[null,null,"2401 - 2800",73.150000000000006,83.74,93.37,103,112.63,122.22,131.86000000000001,141.47999999999999,151.09,202.48,283.98,315.88,375.26,421.21]
[]
[null,"Melamine Mattwood 25mm"]
[null,13,"WIDTH (mm)"]
[null,"HEIGHT (mm)",null,"80-200","201-300","301-350","351-400","401-450","451-500","501-550","551-600","601-650","651-900","901-1300","1301-1500","1501-1800","1801-2000"]
[null,null,"80-200",29.1,32.22,33.86,35.47,37.090000000000003,38.729999999999997,40.369999999999997,42.01,43.64,54.64,71.59,77,91.48,100.62]
[null,null,"201-400",37.75,43.21,43.34,46.19,49.01,51.85,54.72,57.55,60.41,77.52,104.32,116.59,138.5,152.35]
[null,null,"401-600",42.02,46.12,51.75,55.71,58.69,63.63,67.540000000000006,71.48,74.180000000000007,100.98,129.16,141.27000000000001,168.06,185.46]
[null,null,"601-750",47.18,48.31,52.64,54.81,60.12,65.66,69.73,72,76.53,103.06,130.5,150.09,179.3,190.16]
[null,null,"751-900",54.18,56.24,59.18,61.88,67.25,73.349999999999994,77.709999999999994,81.5,86.54,111.38,138.13,154.41,183.44,201.79]
[null,null,"901-1200",60.55,67.92,71,72.45,78.25,81.05,83.83,89.51,95.18,126.23,175.34,196.97,233.99,257.39]
[null,null,"1201-1500",58.83,65.209999999999994,75.28,79.25,86.28,93.3,100.31,107.35,114.37,152.37,212.6,234.98,279.14999999999998,307.06]
[null,null,"1501-1800",66.36,74.930000000000007,83.31,91.66,100.06,108.43,116.8,125.16,133.53,178.52,249.82,277.81,330.04,363.04]
[null,null,"1801-2100",73.94,84.65,94.38,104.1,113.84,123.53,133.29,143,152.71,204.65,287.02,319.26,379.29,417.22]
[null,null,"2101-2400",82.81,94.8,105.7,116.59,127.5,138.36000000000001,149.27000000000001,160.15,171.04,229.21,321.47000000000003,357.58,424.8,467.28]
[null,null,"2401 - 2780",94,107.61,119.99,132.36000000000001,144.72999999999999,157.06,169.45,181.81,194.16,260.19,364.92,405.91,482.21,541.26]
[]
[null,"Melamine Feelwood 18mm"]
[null,14,"WIDTH (mm)"]
[null,"HEIGHT (mm)",null,"80-200","201-300","301-350","351-400","401-450","451-500","501-550","551-600","601-650","651-900","901-1300","1301-1500","1501-1800","1801-2000"]
[null,null,"80-200",25.15,27.85,29.28,30.67,32.06,33.49,34.9,36.32,37.729999999999997,47.24,61.9,66.58,79.09,87]
[null,null,"201-400",32.630000000000003,37.35,37.47,39.93,42.38,44.83,47.31,49.75,52.23,67.02,90.2,100.81,119.76,131.72999999999999]
[null,null,"401-600",36.33,39.880000000000003,44.75,48.16,50.74,55.01,58.39,61.8,64.13,87.31,111.68,122.15,145.31,160.36000000000001]
[null,null,"601-750",40.78,41.77,45.51,47.38,51.97,56.77,60.29,62.25,66.17,89.11,112.83,129.78,155.03,164.43]
[null,null,"751-900",46.84,48.63,51.16,53.5,58.14,63.42,67.180000000000007,70.47,74.819999999999993,96.3,119.43,133.52000000000001,158.62,174.48]
[null,null,"901-1200",52.35,58.73,61.39,62.64,67.650000000000006,70.08,72.48,77.39,82.3,109.14,151.61000000000001,170.31,202.32,222.55]
[null,null,"1201-1500",50.87,56.38,65.09,68.52,74.599999999999994,80.67,86.74,92.82,98.88,131.74,183.82,203.17,241.37,265.5]
[null,null,"1501-1800",57.38,64.790000000000006,72.03,79.260000000000005,86.51,93.76,100.99,108.23,115.45,154.35,216.01,240.21,285.37,313.91000000000003]
[null,null,"1801-2100",63.93,73.180000000000007,81.599999999999994,90.01,98.43,106.81,115.24,123.64,132.05000000000001,176.95,248.18,276.06,327.95,360.75]
[null,null,"2101-2400",71.599999999999994,81.97,91.39,100.82,110.24,119.63,129.07,138.47999999999999,147.88999999999999,198.19,277.95999999999998,309.18,367.31,404.04]
[null,null,"2401 - 2800",81.28,93.05,103.74,114.44,125.14,135.80000000000001,146.51,157.19999999999999,167.88,224.97,315.52999999999997,350.97,416.96,468.01]
[]
[null,"Melamine Feelwood 25mm"]
[null,15,"WIDTH (mm)"]
[null,"HEIGHT (mm)",null,"80-200","201-300","301-350","351-400","401-450","451-500","501-550","551-600","601-650","651-900","901-1300","1301-1500","1501-1800","1801-2000"]
[null,null,"80-200",29.68,32.869999999999997,34.54,36.19,37.840000000000003,39.51,41.18,42.86,44.52,55.75,73.040000000000006,78.56,93.33,102.66]
[null,null,"201-400",38.5,44.08,44.21,47.12,50.01,52.9,55.82,58.71,61.63,79.09,106.43,118.95,141.31,155.44999999999999]
[null,null,"401-600",42.87,47.05,52.8,56.83,59.87,64.91,68.900000000000006,72.92,75.67,103.03,131.78,144.13,171.46,189.22]
[null,null,"601-750",48.12,49.29,53.7,55.91,61.33,66.989999999999995,71.14,73.45,78.069999999999993,105.15,133.13999999999999,153.13999999999999,182.94,194.02]
[null,null,"751-900",55.27,57.38,60.37,63.13,68.599999999999994,74.84,79.28,83.16,88.28,113.63,140.93,157.55000000000001,187.17,205.88]
[null,null,"901-1200",61.78,69.3,72.44,73.92,79.83,82.69,85.52,91.32,97.11,128.79,178.89,200.96,238.74,262.61]
[null,null,"1201-1500",60.03,66.52,76.8,80.86,88.02,95.19,102.35,109.53,116.68,155.46,216.91,239.74,284.81,313.29000000000002]
[null,null,"1501-1800",67.709999999999994,76.45,85,93.52,102.08,110.63,119.17,127.71,136.22999999999999,182.14,254.89,283.45,336.74,370.41]
[null,null,"1801-2100",75.44,86.36,96.29,106.22,116.15,126.04,135.97999999999999,145.9,155.82,208.8,292.85000000000002,325.75,386.99,425.68]
[null,null,"2101-2400",84.49,96.72,107.84,118.96,130.08000000000001,141.16,152.30000000000001,163.41,174.51,233.86,328,364.84,433.42,476.77]
[null,null,"2401 - 2780",95.91,109.79,122.42,135.04,147.66,160.24,172.88,185.49,198.1,265.47000000000003,372.33,414.15,492.01,552.25]
[]
[null,"PerfectSense Matt & Gloss 18mm"]
[null,16,"WIDTH (mm)"]
[null,"HEIGHT (mm)",null,"80-200","201-300","301-350","351-400","401-450","451-500","501-550","551-600","601-650","651-900","901-1300","1301-1500","1501-1800","1801-2000"]
[null,null,"80-200",31.57,34.950000000000003,36.74,38.49,40.24,42.03,43.79,45.58,47.35,59.29,77.680000000000007,83.56,99.26,109.19]
[null,null,"201-400",40.950000000000003,46.88,47.02,50.11,53.19,56.26,59.37,62.44,65.55,84.11,113.2,126.51,150.30000000000001,165.33]
[null,null,"401-600",45.6,50.05,56.16,60.44,63.68,69.03,73.28,77.55,80.48,109.58,140.16,153.29,182.36,201.25]
[null,null,"601-750",51.18,52.42,57.12,59.47,65.23,71.239999999999995,75.67,78.12,83.04,111.83,141.61000000000001,162.87,194.56,206.35]
[null,null,"751-900",58.78,61.03,64.209999999999994,67.14,72.959999999999994,79.599999999999994,84.31,88.44,93.89,120.85,149.88,167.56,199.06,218.97]
[null,null,"901-1200",65.7,73.7,77.040000000000006,78.61,84.9,87.95,90.96,97.13,103.28,136.97,190.26,213.73,253.91,279.3]
[null,null,"1201-1500",63.84,70.75,81.69,86,93.62,101.24,108.85,116.49,124.1,165.34,230.69,254.98,302.91000000000003,333.21]
[null,null,"1501-1800",72.010000000000005,81.31,90.4,99.47,108.57,117.66,126.74,135.82,144.88999999999999,193.71,271.08999999999997,301.47000000000003,358.14,393.96]
[null,null,"1801-2100",80.23,91.85,102.41,112.97,123.53,134.05000000000001,144.62,155.16999999999999,165.72,222.07,311.47000000000003,346.45,411.58,452.74]
[null,null,"2101-2400",89.86,102.87,114.69,126.52,138.35,150.13999999999999,161.97999999999999,173.79,185.6,248.72,348.84,388.02,460.97,507.07]
[null,null,"2401 - 2780",102.01,116.77,130.19999999999999,143.62,157.05000000000001,170.43,183.87,197.28,210.69,282.33999999999997,395.99,440.47,523.28,587.35]
[]
[null,"Acrylic Crisp White Single Sided 18mm"]
[null,17,"WIDTH (mm)"]
[null,"HEIGHT (mm)",null,"80-200","201-300","301-350","351-400","401-450","451-500","501-550","551-600","601-650","651-900","901-1200"]
[null,null,"80-200",23.14,25.63,26.93,28.22,29.5,30.81,32.1,33.409999999999997,34.71,43.47,48.51]
[null,null,"201-400",30.02,34.369999999999997,34.47,36.74,38.99,41.24,43.52,45.77,48.05,61.66,73.45]
[null,null,"401-600",33.43,36.69,41.17,44.31,46.68,50.61,53.72,56.85,59,80.33,89.12]
[null,null,"601-750",37.520000000000003,38.43,41.87,43.59,47.82,52.23,55.47,57.27,60.87,81.98,95.09]
[null,null,"751-900",43.09,44.74,47.07,49.22,53.49,58.35,61.81,64.83,68.83,88.59,97.29]
[null,null,"901-1200",48.17,54.03,56.48,57.63,62.24,64.47,66.680000000000007,71.2,75.709999999999994,100.41,124.09]
[null,null,"1201-1500",46.8,51.87,59.88,63.04,68.63,74.22,79.8,85.39,90.97,121.2,148.04]
[null,null,"1501-1800",52.79,59.61,66.27,72.92,79.59,86.26,92.91,99.57,106.21,142.01,175.03]
[null,null,"1801-2100",58.82,67.33,75.069999999999993,82.81,90.56,98.27,106.02,113.75,121.48,162.80000000000001,201.15]
[null,null,"2101-2400",65.88,75.41,84.08,92.75,101.42,110.06,118.74,127.4,136.06,182.33,225.28]
[null,null,"2401 - 2780",74.78,85.6,95.44,105.29,115.13,124.94,134.79,144.62,154.44999999999999,206.98,255.73]
[]
[null,"Acrylic Pure White Single Sided 18mm"]
[null,18,"WIDTH (mm)"]
[null,"HEIGHT (mm)",null,"80-200","201-300","301-350","351-400","401-450","451-500","501-550","551-600","601-650","651-900","901-1200"]
[null,null,"80-200",27.17,30.08,31.62,33.119999999999997,34.630000000000003,36.17,37.69,39.22,40.75,51.02,56.95]
[null,null,"201-400",35.24,40.340000000000003,40.47,43.13,45.77,48.41,51.09,53.73,56.41,72.38,86.23]
[null,null,"401-600",39.24,43.07,48.33,52.02,54.8,59.41,63.07,66.739999999999995,69.260000000000005,94.3,104.62]
[null,null,"601-750",44.05,45.11,49.15,51.17,56.13,61.31,65.12,67.23,71.459999999999994,96.24,111.62]
[null,null,"751-900",50.59,52.52,55.25,57.78,62.79,68.5,72.56,76.11,80.8,104,114.2]
[null,null,"901-1200",56.54,63.42,66.3,67.650000000000006,73.06,75.69,78.28,83.58,88.88,117.87,145.66999999999999]
[null,null,"1201-1500",54.94,60.89,70.3,74.010000000000005,80.56,87.12,93.67,100.24,106.79,142.28,173.79]
[null,null,"1501-1800",61.97,69.97,77.8,85.6,93.43,101.26,109.07,116.88,124.69,166.7,205.47]
[null,null,"1801-2100",69.05,79.040000000000006,88.13,97.22,106.3,115.36,124.46,133.53,142.61000000000001,191.11,236.13]
[null,null,"2101-2400",77.33,88.52,98.7,108.88,119.06,129.19999999999999,139.38999999999999,149.56,159.72,214.04,264.45999999999998]
[null,null,"2401 - 2780",87.78,100.49,112.04,123.6,135.15,146.66,158.22999999999999,169.77,181.31,242.97,300.20999999999998]
[]
[null,"Acrylic Pure White Double Sided 18mm"]
[null,19,"WIDTH (mm)"]
[null,"HEIGHT (mm)",null,"80-200","201-300","301-350","351-400","401-450","451-500","501-550","551-600","601-650","651-900","901-1200"]
[null,null,"80-200",35.21,38.99,40.98,42.94,44.89,46.88,48.85,50.84,52.82,66.14,73.819999999999993]
[null,null,"201-400",45.68,52.29,52.45,55.9,59.33,62.76,66.23,69.650000000000006,73.12,93.83,111.78]
[null,null,"401-600",50.87,55.83,62.65,67.430000000000007,71.040000000000006,77.010000000000005,81.75,86.51,89.78,122.24,135.62]
[null,null,"601-750",57.1,58.47,63.71,66.34,72.760000000000005,79.48,84.41,87.15,92.63,124.75,144.69999999999999]
[null,null,"751-900",65.569999999999993,68.08,71.62,74.900000000000006,81.39,88.79,94.05,98.66,104.74,134.81,148.04]
[null,null,"901-1200",73.290000000000006,82.22,85.94,87.7,94.71,98.11,101.47,108.35,115.21,152.80000000000001,188.83]
[null,null,"1201-1500",71.22,78.92,91.12,95.93,104.43,112.94,121.43,129.94999999999999,138.43,184.44,225.28]
[null,null,"1501-1800",80.33,90.7,100.85,110.96,121.12,131.26,141.38999999999999,151.51,161.63,216.09,266.35000000000002]
[null,null,"1801-2100",89.5,102.46,114.24,126.02,137.80000000000001,149.54,161.33000000000001,173.1,184.86,247.73,306.08999999999997]
[null,null,"2101-2400",100.24,114.75,127.95,141.13999999999999,154.33000000000001,167.48,180.69,193.87,207.05,277.45999999999998,342.82]
[null,null,"2401 - 2780",113.79,130.26,145.24,160.22,175.19,190.12,205.11,220.07,235.03,314.95999999999998,389.16]
[]
[null,"Meraki 18mm Double Sided"]
[null,20,"WIDTH (mm)"]
[null,"HEIGHT (mm)",null,"80-200","201-300","301-350","351-400","401-450","451-500","501-550","551-600","601-650","651-900","901-1200"]
[null,null,"80-200",31.57,34.950000000000003,36.74,38.49,40.24,42.03,43.79,45.58,47.35,59.29,66.180000000000007]
[null,null,"201-400",40.950000000000003,46.88,47.02,50.11,53.19,56.26,59.37,62.44,65.55,84.11,100.2]
[null,null,"401-600",45.6,50.05,56.16,60.44,63.68,69.03,73.28,77.55,80.48,109.58,121.57]
[null,null,"601-750",51.18,52.42,57.12,59.47,65.23,71.239999999999995,75.67,78.12,83.04,111.83,129.71]
[null,null,"751-900",58.78,61.03,64.209999999999994,67.14,72.959999999999994,79.599999999999994,84.31,88.44,93.89,120.85,132.71]
[null,null,"901-1200",65.7,73.7,77.040000000000006,78.61,84.9,87.95,90.96,97.13,103.28,136.97,169.28]
[null,null,"1201-1500",63.84,70.75,81.69,86,93.62,101.24,108.85,116.49,124.1,165.34,201.94]
[null,null,"1501-1800",72.010000000000005,81.31,90.4,99.47,108.57,117.66,126.74,135.82,144.88999999999999,193.71,238.76]
[null,null,"1801-2100",80.23,91.85,102.41,112.97,123.53,134.05000000000001,144.62,155.16999999999999,165.72,222.07,274.39]
[null,null,"2101-2400",89.86,102.87,114.69,126.52,138.35,150.13999999999999,161.97999999999999,173.79,185.6,248.72,307.32]
[null,null,"2401 - 2780",102.01,116.77,130.19999999999999,143.62,157.05000000000001,170.43,183.87,197.28,210.69,282.33999999999997,348.85]
[]
[null,"50mm Eurolight (price per sq metre)"]
[null,21]
[null,200.4639]